You need to enable JavaScript to run this app.
优惠活动
大模型
产品
解决方案
定价
更多

gradle init转换简单Maven项目触发CycleDetectedException求助

Maven转Gradle时触发CycleDetectedException的原因与解决办法

问题场景

我有一个仅包含junit和assertj-core两个测试依赖的简单Maven Java项目,执行gradle init尝试转换为Gradle项目时,触发了CycleDetectedException,完整错误信息如下:

alik@ap:~/DevP/lean$ gradle --stacktrace init
:wrapper UP-TO-DATE
:init
Maven to Gradle conversion is an incubating feature.
:init FAILED

FAILURE: Build failed with an exception.

* What went wrong:
Execution failed for task ':init'.
> Could not convert Maven POM /home/alik/DevP/lean/pom.xml to a Gradle build.
> Unable to create Maven project model using POM /home/alik/DevP/lean/pom.xml.
> Cycle detected in component graph in the system:

* Try:
Run with --info or --debug option to get more log output.

* Exception is:
org.gradle.api.tasks.TaskExecutionException: Execution failed for task ':init'.
	at org.gradle.api.internal.tasks.execution.ExecuteActionsTaskExecuter.executeActions(ExecuteActionsTaskExecuter.java:69)
	at org.gradle.api.internal.tasks.execution.ExecuteActionsTaskExecuter.execute(ExecuteActionsTaskExecuter.java:46)
	at org.gradle.api.internal.tasks.execution.PostExecutionAnalysisTaskExecuter.execute(PostExecutionAnalysisTaskExecuter.java:35)
	at org.gradle.api.internal.tasks.execution.SkipUpToDateTaskExecuter.execute(SkipUpToDateTaskExecuter.java:64)
	at org.gradle.api.internal.tasks.execution.ValidatingTaskExecuter.execute(ValidatingTaskExecuter.java:58)
	at org.gradle.api.internal.tasks.execution.SkipEmptySourceFilesTaskExecuter.execute(SkipEmptySource...

可能原因

这个错误不是你的项目依赖真的存在循环(junit和assertj-core之间没有依赖循环),大概率是以下几个原因导致:

  • Gradle版本bug:Maven转Gradle是Gradle的孵化功能,旧版本的Gradle在解析POM时存在内部组件图循环的bug,尤其是处理默认Maven父POM或依赖范围时容易触发。
  • 本地Maven仓库缓存损坏:本地~/.m2/repository里的依赖元数据(比如junit或assertj-core的POM文件)损坏,导致Gradle解析时误判为循环。
  • POM文件隐性问题:比如依赖的scope设置异常(比如不小心把测试依赖的scope写成compile)、重复声明依赖等,也可能触发解析错误。

解决办法

1. 升级Gradle到最新稳定版

这是最有效的解决办法,Gradle一直在修复孵化功能的bug。先更新Gradle wrapper:

./gradlew wrapper --gradle-version 8.5 # 替换为当前最新稳定版

之后重新执行gradle init即可。

2. 清理本地Maven仓库缓存

删除本地仓库中junit和assertj-core的相关目录,让Gradle重新下载完整的依赖元数据:

rm -rf ~/.m2/repository/junit/junit
rm -rf ~/.m2/repository/org/assertj

清理完成后再次尝试转换操作。

3. 检查并修复POM文件

确认你的POM里的依赖声明正确,测试依赖的scope必须是test,且无重复声明:

<dependencies>
    <dependency>
        <groupId>junit</groupId>
        <artifactId>junit</artifactId>
        <version>4.13.2</version>
        <scope>test</scope>
    </dependency>
    <dependency>
        <groupId>org.assertj</groupId>
        <artifactId>assertj-core</artifactId>
        <version>3.24.2</version>
        <scope>test</scope>
    </dependency>
</dependencies>

4. 手动创建Gradle项目(绕过转换插件)

如果以上方法都不行,直接手动搭建Gradle项目反而更高效:

  1. 执行gradle init,选择java-library或java-application类型
  2. 在生成的build.gradle(或build.gradle.kts)中添加测试依赖:
// Groovy DSL
dependencies {
    testImplementation 'junit:junit:4.13.2'
    testImplementation 'org.assertj:assertj-core:3.24.2'
}
// Kotlin DSL
dependencies {
    testImplementation("junit:junit:4.13.2")
    testImplementation("org.assertj:assertj-core:3.24.2")
}
  1. 把原Maven项目的src目录复制到新的Gradle项目中(两者目录结构完全一致,无需调整)

内容的提问来源于stack exchange,提问作者AlikElzin-kilaka

相关产品推荐
方舟 Agent Plan

超全模态模型 × Harness 升级,最新支持 Deepseek-V4.1-Flash、GLM-5.3 系列、Doubao-Seedream-5.0-pro、Kimi-K3 (部分), 限时 9.9 元起

最近更新时间:2026.05.21 03:59:43