You need to enable JavaScript to run this app.
优惠活动
大模型
产品
解决方案
定价
更多

Windows环境下Spark DataFrame执行show()方法时遭遇java.io.EOFException错误

Windows环境下Spark DataFrame执行show()方法时遭遇java.io.EOFException错误

看起来你在Windows的Miniconda虚拟环境里跑PySpark代码时,调用df.show()触发了Py4JJavaError,底层是java.io.EOFException,还提示Python worker意外崩溃了对吧?我先把你的测试代码和错误信息整理清楚,再说说几个针对性的解决思路:

你的测试代码

from pyspark.sql import SparkSession

spark = SparkSession.builder.master("local").appName("PySpark Installation Test").getOrCreate()
spark.sparkContext.setLogLevel("DEBUG")
df = spark.createDataFrame([(1, "Hello"), (2, "World")], ["id", "message"])
df.show()

触发的错误信息

---------------------------------------------------------------------------
Py4JJavaError                             Traceback (most recent call last)
Cell In[4], line 2
      1 df = spark.createDataFrame([(1, "Hello"), (2, "World")], ["id", "message"])
----> 2 df.show()

File c:\Users\hermo\miniconda3\envs\nudgerank-venv\Lib\site-packages\pyspark\sql\dataframe.py:947, in DataFrame.show(self, n, truncate, vertical)
    887 def show(self, n: int = 20, truncate: Union[bool, int] = True, vertical: bool = False) -> None:
    888     """Prints the first ``n`` rows to the console.
    889 
    890     .. versionadded:: 1.3.0
   (...)
    945     name | Bob
    946     """
---> 947     print(self._show_string(n, truncate, vertical))

File c:\Users\hermo\miniconda3\envs\nudgerank-venv\Lib\site-packages\pyspark\sql\dataframe.py:965, in DataFrame._show_string(self, n, truncate, vertical)
    959     raise PySparkTypeError(
    960         error_class="NOT_BOOL",
    961         message_parameters={"arg_name": "vertical", "arg_type": type(vertical).__name__},
    962     )
    964 if isinstance(truncate, bool) and truncate:
---> 965     return self._jdf.showString(n, 20, vertical)
    966 else:
    967     try:

File c:\Users\hermo\miniconda3\envs\nudgerank-venv\Lib\site-packages\py4j\java_gateway.py:1322, in JavaMember.__call__(self, *args)
   1316 command = proto.CALL_COMMAND_NAME +\
   1317     self.command_header +\
   1318     args_command +\
   1319     proto.END_COMMAND_PART
   1321 answer = self.gateway_client.send_command(command)
-> 1322 return_value = get_return_value(
   1323     answer, self.gateway_client, self.target_id, self.name)
   1325 for temp_arg in temp_args:
   1326     if hasattr(temp_arg, "_detach"):

File c:\Users\hermo\miniconda3\envs\nudgerank-venv\Lib\site-packages\pyspark\errors\exceptions\captured.py:179, in capture_sql_exception.<locals>.deco(*a, **kw)
    177 def deco(*a: Any, **kw: Any) -> Any:
    178     try:
---> 179         return f(*a, **kw)
    180     except Py4JJavaError as e:
    181         converted = convert_exception(e.java_exception)

File c:\Users\hermo\miniconda3\envs\nudgerank-venv\Lib\site-packages\py4j\protocol.py:326, in get_return_value(answer, gateway_client, target_id, name)
    324 value = OUTPUT_CONVERTER[type](answer[2:], gateway_client)
    325 if answer[1] == REFERENCE_TYPE:
---> 326     raise Py4JJavaError(
    327         "An error occurred while calling {0}{1}{2}.\n".
    328         format(target_id, ".", name), value)
    329 else:
    330     raise Py4JError(
    331         "An error occurred while calling {0}{1}{2}. Trace:\n{3}\n".
    332         format(target_id, ".", name, value))

Py4JJavaError: An error occurred while calling o43.showString.
: org.apache.spark.SparkException: Job aborted due to stage failure: Task 0 in stage 0.0 failed 1 times, most recent failure: Lost task 0.0 in stage 0.0 (TID 0) (host.docker.internal executor driver): org.apache.spark.SparkException: Python worker exited unexpectedly (crashed)
    at org.apache.spark.api.python.BasePythonRunner$ReaderIterator$$anonfun$1.applyOrElse(PythonRunner.scala:612)
    at org.apache.spark.api.python.BasePythonRunner$ReaderIterator$$anonfun$1.applyOrElse(PythonRunner.scala:594)
    at scala.runtime.AbstractPartialFunction.apply(AbstractPartialFunction.scala:38)
    at org.apache.spark.api.python.PythonRunner$$anon$3.read(PythonRunner.scala:789)
    at org.apache.spark.api.python.PythonRunner$$anon$3.read(PythonRunner.scala:766)
    at org.apache.spark.api.python.BasePythonRunner$ReaderIterator.hasNext(PythonRunner.scala:525)
    at org.apache.spark.InterruptibleIterator.hasNext(InterruptibleIterator.scala:37)
    at scala.collection.Iterator$$anon$11.hasNext(Iterator.scala:491)
    at scala.collection.Iterator$$anon$10.hasNext(Iterator.scala:460)
    at scala.collection.Iterator$$anon$10.hasNext(Iterator.scala:460)
    at org.apache.spark.sql.catalyst.expressions.GeneratedClass$GeneratedIteratorForCodegenStage1.processNext(generated.java:26)
    at org.apache.spark.sql.execution.BufferedRowIterator.hasNext(BufferedRowIterator.java:43)
    at org.apache.spark.sql.execution.WholeStageCodegenEvaluatorFactory$WholeStageCodegenPartitionEvaluator$$anon$1.hasNext(WholeStageCodegenEvaluatorFactory.scala:43)
    at org.apache.spark.sql.execution.SparkPlan.$anonfun$getByteArrayRdd$1(SparkPlan.scala:388)
    at org.apache.spark.rdd.RDD.$anonfun$mapPartitionsInternal$2(RDD.scala:893)
    at org.apache.spark.rdd.RDD.$anonfun$mapPartitionsInternal$2$adapted(RDD.scala:893)
    at org.apache.spark.rdd.MapPartitionsRDD.compute(MapPartitionsRDD.scala:52)
    at org.apache.spark.rdd.RDD.computeOrReadCheckpoint(RDD.scala:367)
    at org.apache.spark.rdd.RDD.iterator(RDD.scala:331)
    at org.apache.spark.scheduler.ResultTask.runTask(ResultTask.scala:93)
    at org.apache.spark.TaskContext.runTaskWithListeners(TaskContext.scala:166)
    at org.apache.spark.scheduler.Task.run(Task.scala:141)
    at org.apache.spark.executor.Executor$TaskRunner.$anonfun$run$4(Executor.scala:620)
    at org.apache.spark.util.SparkErrorUtils.tryWithSafeFinally(SparkErrorUtils.scala:64)
    at org.apache.spark.util.SparkErrorUtils.tryWithSafeFinally$(SparkErrorUtils.scala:61)
    at org.apache.spark.util.Utils$.tryWithSafeFinally(Utils.scala:94)
    at org.apache.spark.executor.Executor$TaskRunner.run(Executor.scala:623)
    at java.base/java.util.concurrent.ThreadPoolExecutor.runWorker(ThreadPoolExecutor.java:1144)
    at java.base/java.util.concurrent.ThreadPoolExecutor$Worker.run(ThreadPoolExecutor.java:642)
    at java.base/java.lang.Thread.run(Thread.java:1583)
Caused by: java.io.EOFException
    at java.base/java.io.DataInputStream.readFully(DataInputStream.java:210)
    at java.base/java.io.DataInputStream.readInt(DataInputStream.java:385)
    at org.apache.spark.api.python.PythonRunner$$anon$3.read(PythonRunner.scala:774)
    ... 26 more

Driver stacktrace:
    at org.apache.spark.scheduler.DAGScheduler.failJobAndIndependentStages(DAGScheduler.scala:2856)
    at org.apache.spark.scheduler.DAGScheduler.$anonfun$abortStage$2(DAGScheduler.scala:2792)
    at org.apache.spark.scheduler.DAGScheduler.$anonfun$abortStage$2$adapted(DAGScheduler.scala:2791)
    at scala.collection.mutable.ResizableArray.foreach(ResizableArray.scala:62)
    at scala.collection.mutable.ResizableArray.foreach$(ResizableArray.scala:55)
    at scala.collection.mutable.ArrayBuffer.foreach(ArrayBuffer.scala:49)
    at org.apache.spark.scheduler.DAGScheduler.abortStage(DAGScheduler.scala:2791)
    at org.apache.spark.scheduler.DAGScheduler.$anonfun$handleTaskSetFailed$1(DAGScheduler.scala:1247)
    at org.apache.spark.scheduler.DAGScheduler.$anonfun$handleTaskSetFailed$1$adapted(DAGScheduler.scala:1247)
    at scala.Option.foreach(Option.scala:407)
    at org.apache.spark.scheduler.DAGScheduler.handleTaskSetFailed(DAGScheduler.scala:1247)
    at org.apache.spark.scheduler.DAGSchedulerEventProcessLoop.doOnReceive(DAGScheduler.scala:3060)
    at org.apache.spark.scheduler.DAGSchedulerEventProcessLoop.onReceive(DAGScheduler.scala:2994)
    at org.apache.spark.scheduler.DAGSchedulerEventProcessLoop.onReceive(DAGScheduler.scala:2983)
    at org.apache.spark.util.EventLoop$$anon$1.run(EventLoop.scala:49)
    at org.apache.spark.scheduler.DAGScheduler.runJob(DAGScheduler.scala:989)
    at org.apache.spark.SparkContext.runJob(SparkContext.scala:2393)
    at org.apache.spark.SparkContext.runJob(SparkContext.scala:2414)
    at org.apache.spark.SparkContext.runJob(SparkContext.scala:2433)
    at org.apache.spark.sql.execution.SparkPlan.executeTake(SparkPlan.scala:530)
    at org.apache.spark.sql.execution.SparkPlan.executeTake(SparkPlan.scala:483)
    at org.apache.spark.sql.execution.CollectLimitExec.executeCollect(limit.scala:61)
    at org.apache.spark.sql.Dataset.collectFromPlan(Dataset.scala:4333)
    at org.apache.spark.sql.Dataset.$anonfun$head$1(Dataset.scala:3316)
    at org.apache.spark.sql.Dataset.$anonfun$withAction$2(Dataset.scala:4323)
    at org.apache.spark.sql.execution.QueryExecution$.withInternalError(QueryExecution.scala:546)
    at org.apache.spark.sql.Dataset.$anonfun$withAction$1(Dataset.scala:4321)
    at org.apache.spark.sql.execution.SQLExecution$.$anonfun$withNewExecutionId$6(SQLExecution.scala:125)
    at org.apache.spark.sql.execution.SQLExecution$.withSQLConfPropagated(SQLExecution.scala:201)
    at org.apache.spark.sql.execution.SQLExecution$.$anonfun$withNewExecutionId$1(SQLExecution.scala:108)
    at org.apache.spark.sql.SparkSession.withActive(SparkSession.scala:900)
    at org.apache.spark.sql.execution.SQLExecution$.withNewExecutionId(SQLExecution.scala:66)
    at org.apache.spark.sql.Dataset.withAction(Dataset.scala:4321)
    at org.apache.spark.sql.Dataset.head(Dataset.scala:3316)
    at org.apache.spark.sql.Dataset.take(Dataset.scala:3539)
    at org.apache.spark.sql.Dataset.getRows(Dataset.scala:280)
    at org.apache.spark.sql.Dataset.showString(Dataset.scala:315)
    at java.base/jdk.internal.reflect.NativeMethodAccessorImpl.invoke0(Native Method)
    at java.base/jdk.internal.reflect.NativeMethodAccessorImpl.invoke(NativeMethodAccessorImpl.java:75)
    at java.base/jdk.internal.reflect.DelegatingMethodAccessorImpl.invoke(DelegatingMethodAccessorImpl.java:52)
    at java.base/java.lang.reflect.Method.invoke(Method.java:580)
    at py4j.reflection.MethodInvoker.invoke(MethodInvoker.java:244)
    at py4j.reflection.ReflectionEngine.invoke(ReflectionEngine.java:374)
    at py4j.Gateway.invoke(Gateway.java:282)
    at py4j.commands.AbstractCommand.invokeMethod(AbstractCommand.java:132)
    at py4j.commands.CallCommand.execute(CallCommand.java:79)
    at py4j.ClientServerConnection.waitForCommands(ClientServerConnection.java:182)
    at py4j.ClientServerConnection.run(ClientServerConnection.java:106)
    at java.base/java.lang.Thread.run(Thread.java:1583)

针对性解决思路

  • 显式指定虚拟环境的Python解释器路径
    Windows下PySpark经常会找不到虚拟环境里的Python,导致worker启动崩溃。你可以在创建SparkSession时直接指定虚拟环境的Python绝对路径:
from pyspark.sql import SparkSession

# 替换成你自己虚拟环境的python.exe路径
python_exe_path = "c:\\Users\\hermo\\miniconda3\\envs\\nudgerank-venv\\python.exe"

spark = SparkSession.builder.master("local").appName("PySpark Installation Test") \
    .config("spark.pyspark.python", python_exe_path) \
    .config("spark.pyspark.driver.python", python_exe_path) \
    .getOrCreate()
spark.sparkContext.setLogLevel("WARN")  # 先调低日志级别,减少IO压力
df = spark.createDataFrame([(1, "Hello"), (2, "World")], ["id", "message"])
df.show()
  • 检查Spark与Python的版本兼容性
    如果你的Python版本是3.12+,而Spark版本低于3.5,大概率会因为API不兼容导致worker崩溃。建议你:

    • Spark 3.5.x 对应 Python 3.8-3.12
    • Spark 3.3/3.4.x 对应 Python 3.8-3.11
      版本不匹配的话,要么升级Spark,要么降级Python版本。
  • 临时关闭Windows防火墙或添加例外
    Windows Defender防火墙有时候会拦截Spark Driver和Worker之间的本地通信,导致连接中断触发EOFException。你可以临时关闭防火墙测试,或者把Spark安装目录、虚拟环境目录添加到防火墙允许列表。

  • 确认虚拟环境的权限
    右键虚拟环境目录(c:\Users\hermo\miniconda3\envs\nudgerank-venv)→ 属性 → 安全,确保当前用户拥有读取、写入、修改的权限。权限不足会导致worker无法加载依赖或写入临时文件。

备注:内容来源于stack exchange,提问作者Teo Hui Fang

相关产品推荐
方舟 Agent Plan

超全模态模型 × Harness 升级,最新支持 Deepseek-V4.1-Flash、GLM-5.3 系列、Doubao-Seedream-5.0-pro、Kimi-K3 (部分), 限时 9.9 元起

最近更新时间:2026.04.14 12:44:38