You need to enable JavaScript to run this app.
优惠活动
大模型
产品
解决方案
定价
更多

编译Vulkan的Anvil框架示例时遇链接错误:无法找到-lvulkan

解决链接器找不到libvulkan的编译错误

[ 97%] Linking CXX executable OutOfOrderRasterization
/usr/bin/ld: cannot find -lvulkan
collect2: error: ld returned 1 exit status
CMakeFiles/OutOfOrderRasterization.dir/build.make:126: recipe for target 'OutOfOrderRasterization' failed
make[2]: *** [OutOfOrderRasterization] Error 1
CMakeFiles/Makefile2:72: recipe for target 'CMakeFiles/OutOfOrderRasterization.dir/all' failed
make[1]: *** [CMakeFiles/OutOfOrderRasterization.dir/all] Error 2
Makefile:83: recipe for target 'all' failed
make: *** [all] Error 2

这个错误是Vulkan项目编译时的典型问题——链接器找不到Vulkan的开发库文件,要么是系统没装对应依赖,要么是CMake没正确定位到库的位置。下面是一步步的解决方法:

1. 安装Vulkan开发依赖包

根据你的Linux发行版选择对应命令:

  • Debian/Ubuntu 系列:
    sudo apt update && sudo apt install libvulkan-dev
    
  • Fedora/RHEL 系列:
    sudo dnf install vulkan-devel
    
  • Arch Linux:
    sudo pacman -S vulkan-devel
    

如果你是手动下载了Vulkan SDK而非用包管理安装,需要让系统识别SDK路径:

# 临时生效,重启后失效
export LD_LIBRARY_PATH=$LD_LIBRARY_PATH:/path/to/your/vulkan-sdk/lib
export VK_SDK_PATH=/path/to/your/vulkan-sdk

想永久生效的话,把这两行加到~/.bashrc或~/.zshrc里,再执行source ~/.bashrc加载配置。

2. 重新编译项目

安装完成后,一定要清理旧的编译缓存和产物,避免残留配置干扰:

# 回到项目根目录,删除build文件夹
rm -rf build
mkdir build && cd build
# 重新运行CMake配置
cmake ..
# 再次编译
make

如果是手动安装的SDK,需要在CMake命令里指定SDK路径:

cmake -DCMAKE_PREFIX_PATH=/path/to/your/vulkan-sdk ..

3. 验证Vulkan库是否存在

要是还是报错,可以先确认系统里有没有libvulkan.so文件:

# 搜索系统默认路径
find /usr -name libvulkan.so
# 手动SDK的话,搜索SDK目录
find /path/to/your/vulkan-sdk -name libvulkan.so

如果找到了文件但链接器仍找不到,可以尝试在项目的CMakeLists.txt里手动添加库路径(不推荐,优先用环境变量或包管理方法):

link_directories(/path/to/libvulkan/directory)

内容的提问来源于stack exchange,提问作者K VARK

相关产品推荐
方舟 Agent Plan

超全模态模型 × Harness 升级,最新支持 Deepseek-V4.1-Flash、GLM-5.3 系列、Doubao-Seedream-5.0-pro、Kimi-K3 (部分), 限时 9.9 元起

最近更新时间:2026.05.19 08:57:45