You need to enable JavaScript to run this app.
优惠活动
大模型
产品
解决方案
定价
更多

Gradle构建失败求助:annotationProcessorOutputFolder空值错误

Fixing Gradle Build Failure Due to annotationProcessorOutputFolder=null

Let's break down how to resolve this build error. First, here's the error you encountered:

22:29:49.583 [ERROR] [org.gradle.internal.buildevents.BuildExceptionReporter]
22:29:49.583 [ERROR] [org.gradle.internal.buildevents.BuildExceptionReporter] 失败:构建因异常终止。
22:29:49.583 [ERROR] [org.gradle.internal.buildevents.BuildExceptionReporter]
22:29:49.583 [ERROR] [org.gradle.internal.buildevents.BuildExceptionReporter] * 问题原因:
22:29:49.583 [ERROR] [org.gradle.internal.buildevents.BuildExceptionReporter] 条目存在空值:annotationProcessorOutputFolder=null
22:29:49.584 [ERROR] [org.gradle.internal.buildevents.BuildExceptionReporter]
22:29:49.584 [ERROR] [org.gradle.internal.buildevents.BuildExceptionReporter] * 建议操作:
22:29:49.584 [ERROR] [org.gradle.internal.buildevents.BuildExceptionReporter] 使用--stacktrace参数运行以获取堆栈跟踪信息。
22:29:49.584 [ERROR] [org.gradle.internal.buildevents.BuildExceptionReporter]
22:29:49.584 [ERROR] [org.gradle.internal.buildevents.BuildExceptionReporter] * 获取更多帮助:https://help.gradle.org
22:29:49.584 [ERROR] [org.gradle.internal.buildevents.BuildResultLogger]
22:29:49.585 [ERROR] [org.gradle.internal.buildevents.BuildResultLogger] 构建失败,耗时21秒

This error means Gradle can't locate a valid output directory for your annotation processors—either the configuration is missing, or something is accidentally setting this value to null. Here are actionable fixes to resolve this:

Possible Solutions

1. Explicitly Configure the Annotation Processor Output Directory

Add a clear output path for annotation processors in your module-level build.gradle (or build.gradle.kts for Kotlin projects):

Groovy DSL:

android {
    defaultConfig {
        javaCompileOptions {
            annotationProcessorOptions {
                outputDirectory = file("$buildDir/generated/source/apt/main")
            }
        }
    }
}

Kotlin DSL:

android {
    defaultConfig {
        javaCompileOptions {
            annotationProcessorOptions {
                outputDirectory.set(file("$buildDir/generated/source/apt/main"))
            }
        }
    }
}

2. Verify Annotation Processor Dependencies

Make sure annotation processor libraries are declared with the correct configuration (not just implementation):

Groovy DSL:

dependencies {
    // For Java projects
    annotationProcessor 'com.google.dagger:dagger-compiler:2.x'
    // For Kotlin projects, use kapt instead
    // kapt 'com.google.dagger:dagger-compiler:2.x'
}

3. Clean and Rebuild the Project

Cached build files often cause unexpected issues. Run these commands to reset your build state:

./gradlew clean
./gradlew assembleDebug

4. Update Gradle Plugin and Wrapper

Outdated Gradle versions can have bugs related to annotation processor handling. Update your project's Gradle plugin (project-level build.gradle) and wrapper:

Project-level build.gradle (Groovy):

buildscript {
    dependencies {
        classpath 'com.android.tools.build:gradle:7.4.2' // Use the latest stable version
    }
}

Then update the wrapper:

./gradlew wrapper --gradle-version 7.5 // Match a version compatible with your plugin

5. Check Custom Plugins/Scripts

If you're using custom Gradle plugins or scripts that modify annotation processor settings, double-check they aren't inadvertently setting annotationProcessorOutputFolder to null. Review any task configurations that touch annotation processing logic.

Additional Troubleshooting

If the above steps don't work, run the build with the --stacktrace flag to get detailed error context:

./gradlew assembleDebug --stacktrace

This will show exactly where the null value is being introduced, making it easier to pinpoint the root cause.

内容的提问来源于stack exchange,提问作者Jainik Patel

相关产品推荐
方舟 Agent Plan

超全模态模型 × Harness 升级,最新支持 Deepseek-V4.1-Flash、GLM-5.3 系列、Doubao-Seedream-5.0-pro、Kimi-K3 (部分), 限时 9.9 元起

最近更新时间:2026.05.15 07:36:52