如何为Windows 10 Pro x64 (AMD)编译hadoop.dll和winutils.exe
Windows 10 Pro x64 (AMD) 环境Hadoop 3.2.1运行适配问题
- 需要为 Windows 10 Pro x64 (AMD) 架构编译
hadoop.dll和winutils.exe,多次尝试未成功 - 未找到可直接下载的、适配该系统版本的可用
hadoop.dll或winutils.exe资源
现有公开资源尝试情况
- 尝试过公开仓库的相关资源,版本过于陈旧,仅适配Windows98、Windows NT这类老旧系统
- 已创建
c:\hadoop目录,配置环境变量HADOOP_HOME=c:\hadoop - 将下载的文件放入
c:\hadoop\bin目录后,已把%HADOOP_HOME%\bin添加到Windows系统PATH环境变量中 - 调用时出现如下报错:
java.io.IOException: Cannot run program "C:\hadoop\bin\winutils.exe": CreateProcess error=216, This version of %1 is not compatible with the version of Windows you're running. Check your computer's system information and then contact the software publisher
自行编译失败情况
- 已将2.5.0版本的protoc加入系统路径,zlib1.dll也在路径中,已安装maven和Java,运行搭载make工具的cygwin环境,所有shell命令均可正常使用,在cygwin命令行执行编译操作
- 下载Hadoop源码后执行如下命令:
$mvn -X package -Pdist,native-win -DskipTests -Dtar
- 执行后返回如下堆栈报错,无明确问题指向:
[INFO] ------------------------------------------------------------------------ [INFO] BUILD FAILURE [INFO] ------------------------------------------------------------------------ [INFO] Total time: 38.921 s [INFO] Finished at: 2021-06-03T14:56:21-06:00 [INFO] ------------------------------------------------------------------------ [ERROR] Failed to execute goal org.codehaus.mojo:exec-maven-plugin:1.3.1:exec (pre-dist) on project hadoop-project-dist: Command execution failed.: Process exited with an error: 127 (Exit value: 127) -> [Help 1] org.apache.maven.lifecycle.LifecycleExecutionException: Failed to execute goal org.codehaus.mojo:exec-maven-plugin:1.3.1:exec (pre-dist) on project hadoop-project-dist: Command execution failed. at org.apache.maven.lifecycle.internal.MojoExecutor.execute (MojoExecutor.java:215) at org.apache.maven.lifecycle.internal.MojoExecutor.execute (MojoExecutor.java:156) at org.apache.maven.lifecycle.internal.MojoExecutor.execute (MojoExecutor.java:148) at org.apache.maven.lifecycle.internal.LifecycleModuleBuilder.buildProject (LifecycleModuleBuilder.java:117) at org.apache.maven.lifecycle.internal.LifecycleModuleBuilder.buildProject (LifecycleModuleBuilder.java:81) at org.apache.maven.lifecycle.internal.builder.singlethreaded.SingleThreadedBuilder.build (SingleThreadedBuilder.java:56) at org.apache.maven.lifecycle.internal.LifecycleStarter.execute (LifecycleStarter.java:128) at org.apache.maven.DefaultMaven.doExecute (DefaultMaven.java:305) at org.apache.maven.DefaultMaven.doExecute (DefaultMaven.java:192) at org.apache.maven.DefaultMaven.execute (DefaultMaven.java:105) at org.apache.maven.cli.MavenCli.execute (MavenCli.java:957) at org.apache.maven.cli.MavenCli.doMain (MavenCli.java:289) at org.apache.maven.cli.MavenCli.main (MavenCli.java:193) at jdk.internal.reflect.NativeMethodAccessorImpl.invoke0 (Native Method) at jdk.internal.reflect.NativeMethodAccessorImpl.invoke (NativeMethodAccessorImpl.java:78) at jdk.internal.reflect.DelegatingMethodAccessorImpl.invoke (DelegatingMethodAccessorImpl.java:43) at java.lang.reflect.Method.invoke (Method.java:567) at org.codehaus.plexus.classworlds.launcher.Launcher.launchEnhanced (Launcher.java:282) at org.codehaus.plexus.classworlds.launcher.Launcher.launch (Launcher.java:225) at org.codehaus.plexus.classworlds.launcher.Launcher.mainWithExitCode (Launcher.java:406) at org.codehaus.plexus.classworlds.launcher.Launcher.main (Launcher.java:347) Caused by: org.apache.maven.plugin.MojoExecutionException: Command execution failed. at org.codehaus.mojo.exec.ExecMojo.execute (ExecMojo.java:303) at org.apache.maven.plugin.DefaultBuildPluginManager.executeMojo (DefaultBuildPluginManager.java:137) at org.apache.maven.lifecycle.internal.MojoExecutor.execute (MojoExecutor.java:210) at org.apache.maven.lifecycle.internal.MojoExecutor.execute (MojoExecutor.java:156) at org.apache.maven.lifecycle.internal.MojoExecutor.execute (MojoExecutor.java:148) at org.apache.maven.lifecycle.internal.LifecycleModuleBuilder.buildProject (LifecycleModuleBuilder.java:117) at org.apache.maven.lifecycle.internal.LifecycleModuleBuilder.buildProject (LifecycleModuleBuilder.java:81) at org.apache.maven.lifecycle.internal.builder.singlethreaded.SingleThreadedBuilder.build (SingleThreadedBuilder.java:56) at org.apache.maven.lifecycle.internal.LifecycleStarter.execute (LifecycleStarter.java:128) at org.apache.maven.DefaultMaven.doExecute (DefaultMaven.java:305) at org.apache.maven.DefaultMaven.doExecute (DefaultMaven.java:192) at org.apache.maven.DefaultMaven.execute (DefaultMaven.java:105) at org.apache.maven.cli.MavenCli.execute (MavenCli.java:957) at org.apache.maven.cli.MavenCli.doMain (MavenCli.java:289) at org.apache.maven.cli.MavenCli.main (MavenCli.java:193) at jdk.internal.reflect.NativeMethodAccessorImpl.invoke0 (Native Method) at jdk.internal.reflect.NativeMethodAccessorImpl.invoke (NativeMethodAccessorImpl.java:78) at jdk.internal.reflect.DelegatingMethodAccessorImpl.invoke (DelegatingMethodAccessorImpl.java:43) at java.lang.reflect.Method.invoke (Method.java:567) at org.codehaus.plexus.classworlds.launcher.Launcher.launchEnhanced (Launcher.java:282) at org.codehaus.plexus.classworlds.launcher.Launcher.launch (Launcher.java:225) at org.codehaus.plexus.classworlds.launcher.Launcher.mainWithExitCode (Launcher.java:406) at org.codehaus.plexus.classworlds.launcher.Launcher.main (Launcher.java:347) Caused by: org.apache.commons.exec.ExecuteException: Process exited with an error: 127 (Exit value: 127) at org.apache.commons.exec.DefaultExecutor.executeInternal (DefaultExecutor.java:402) at org.apache.commons.exec.DefaultExecutor.execute (DefaultExecutor.java:164) at org.codehaus.mojo.exec.ExecMojo.executeCommandLine (ExecMojo.java:750) at org.codehaus.mojo.exec.ExecMojo.execute (ExecMojo.java:292) at org.apache.maven.plugin.DefaultBuildPluginManager.executeMojo (DefaultBuildPluginManager.java:137) at org.apache.maven.lifecycle.internal.MojoExecutor.execute (MojoExecutor.java:210) at org.apache.maven.lifecycle.internal.MojoExecutor.execute (MojoExecutor.java:156) at org.apache.maven.lifecycle.internal.MojoExecutor.execute (MojoExecutor.java:148) at org.apache.maven.lifecycle.internal.LifecycleModuleBuilder.buildProject (LifecycleModuleBuilder.java:117) at org.apache.maven.lifecycle.internal.LifecycleModuleBuilder.buildProject (LifecycleModuleBuilder.java:81) at org.apache.maven.lifecycle.internal.builder.singlethreaded.SingleThreadedBuilder.build (SingleThreadedBuilder.java:56) at org.apache.maven.lifecycle.internal.LifecycleStarter.execute (LifecycleStarter.java:128) at org.apache.maven.DefaultMaven.doExecute (DefaultMaven.java:305) at org.apache.maven.DefaultMaven.doExecute (DefaultMaven.java:192) at org.apache.maven.DefaultMaven.execute (DefaultMaven.java:105) at org.apache.maven.cli.MavenCli.execute (MavenCli.java:957) at org.apache.maven.cli.MavenCli.doMain (MavenCli.java:289) at org.apache.maven.cli.MavenCli.main (MavenCli.java:193) at jdk.internal.reflect.NativeMethodAccessorImpl.invoke0 (Native Method) at jdk.internal.reflect.NativeMethodAccessorImpl.invoke (NativeMethodAccessorImpl.java:78) at jdk.internal.reflect.DelegatingMethodAccessorImpl.invoke (DelegatingMethodAccessorImpl.java:43) at java.lang.reflect.Method.invoke (Method.java:567) at org.codehaus.plexus.classworlds.launcher.Launcher.launchEnhanced (Launcher.java:282) at org.codehaus.plexus.classworlds.launcher.Launcher.launch (Launcher.java:225) at org.codehaus.plexus.classworlds.launcher.Launcher.mainWithExitCode (Launcher.java:406) at org.codehaus.plexus.classworlds.launcher.Launcher.main (Launcher.java:347)
诉求
如有在 Windows 10 Pro x64 (AMD) 设备上成功运行 Hadoop 3.2.1 的用户,可分享具体操作方法。
内容的提问来源于stack exchange,提问作者user10664542
相关产品推荐
相关产品推荐

