如何解决Flutter中的'FwfhTextStyle'编译错误?
解决FwfhTextStyle缺失fontVariations实现的编译错误
问题原因
你使用的fwfh_text_style包版本(2.7.3+2)与当前Flutter版本不兼容。Flutter的TextStyle类新增了fontVariations成员变量,但该旧版本的FwfhTextStyle类未实现这个成员,导致编译失败。
解决方案
1. 升级fwfh_text_style到兼容版本
打开项目根目录的pubspec.yaml文件,找到fwfh_text_style依赖项,将版本号更新为3.0.0及以上(该版本已适配新增的fontVariations属性):
dependencies: fwfh_text_style: ^3.0.0
然后执行命令更新依赖:
flutter pub upgrade fwfh_text_style
2. 清理缓存重新构建
如果升级后仍有问题,彻底清理缓存后重新构建:
flutter clean flutter pub get flutter run
3. 确认版本匹配
确保你的Flutter版本与fwfh_text_style的最新版本要求一致,避免出现跨版本兼容问题。
错误日志
Launching lib/main.dart on SM A127F in debug mode... Running Gradle task 'assembleDebug'... ../../flutter/.pub-cache/hosted/pub.dartlang.org/fwfh_text_style-2.7.3+2/lib/fwfh_text_style.dart:11:7: Error: The non-abstract class 'FwfhTextStyle' is missing implementations for these members: - TextStyle.fontVariations Try to either - provide an implementation, - inherit an implementation from a superclass or mixin, - mark the class as abstract, or - provide a 'noSuchMethod' implementation. class FwfhTextStyle extends _TextStyleProxy { ^^^^^^^^^^^^^ ../../flutter/packages/flutter/lib/src/painting/text_style.dart:789:33: Context: 'TextStyle.fontVariations' is defined here. final List<ui.FontVariation>? fontVariations; ^^^^^^^^^^^^^^ FAILURE: Build failed with an exception. * Where: Script '/home/vrs/flutter/packages/flutter_tools/gradle/flutter.gradle' line: 1159 * What went wrong: Execution failed for task ':app:compileFlutterBuildDebug'. > Process 'command '/home/vrs/flutter/bin/flutter'' finished with non-zero exit value 1 * Try: > Run with --stacktrace option to get the stack trace. > Run with --info or --debug option to get more log output. > Run with --scan to get full insights. * Get more help at https://help.gradle.org BUILD FAILED in 16s Exception: Gradle task assembleDebug failed with exit code 1
内容的提问来源于stack exchange,提问作者Vinayak Sutar
相关产品推荐
相关产品推荐

