Parasoft C/C++ Test编译报错:extern "C"语法异常求助
问题描述
尝试为以下简单C++主程序执行单元测试:
#include <iostream> int main() { std::cout << "hello world" << std::endl; return 0; }
运行测试时出现如下错误:
C++test analysis errors in /Demo_aCpp 1. Test execution: error preparing instrumentation / symbols data for file. "/usr/include/sys/features.h", line 25: error: expected an identifier extern "C" { ^ "/usr/include/sys/features.h", line 25: error: expected a ";" extern "C" { ^ "/usr/include/sys/reent.h", line 9: error: expected an identifier extern "C" { ^ "/usr/include/sys/reent.h", line 9: error: expected a ";" extern "C" { ^ ... Error limit reached. 100 errors detected in the compilation of "C:\Users\username\AppData\Local\Temp\ParaSoft.1840.28297.c". Compilation terminated.
解决思路
- 修正编译语言模式:错误日志显示工具在编译
.c后缀的临时文件,说明Ctest误将C代码当作C语言处理。C不支持extern "C"语法,这是核心问题。需在测试配置里强制指定使用C++编译器(如g++),而非C编译器。 - 调整文件类型关联:确保Ctest将你的源文件后缀(如
.cpp)识别为C文件。在工具设置中找到文件类型映射选项,添加或修正对应规则,避免把C++文件归类为C文件。 - 校准头文件路径:错误涉及系统头文件,可能是测试工具的头文件路径与常规C编译环境不匹配。检查工具的包含路径配置,指向正确的C标准库头文件目录,排除纯C的头文件目录干扰。
- 限制插装范围:如果测试工具对系统头文件也执行了代码插装,容易引发语法冲突。配置工具仅对业务代码进行插装,跳过系统头文件的处理。
- 升级测试工具:旧版本的Ctest可能存在C/C文件识别的bug,升级到最新稳定版可尝试解决这类兼容性问题。
内容的提问来源于stack exchange,提问作者never_
相关产品推荐
相关产品推荐

