You need to enable JavaScript to run this app.
优惠活动
大模型
产品
解决方案
定价
更多

编写C++接口类头文件编译报错,寻求解决方案

解决C++接口类头文件的编译错误

问题代码

#ifndef INTERFACE_H
#define INTERFACE_H 

#include <iostream>
#include <vector>
#include <string> 

class Interface
{
private:
    typedef vector<string> programType;
    programType programCode;
    
public:
    void startInterface()
    {
        char q, input;
        do
        {
            cout << "PySUB Interpreter 1.0 on Windows (September 2020)" << endl;
            cout << "Enter program lines or read(<filename>.py) at command line interface" << endl;
            cout << "Type 'help' for more information or 'quit' to exit" << endl;
        } while (input != q);
    }

    void quit();
    void help();
    void show();
    void clear();
};

#endif

编译错误信息

Build started...
1>------ Build started: Project: pysub1, Configuration: Debug x64 ------
1>interface.cpp
1>C:\Users\Johnathon\source\repos\pysub1\pysub1\interface.h(11,16): error C2143: syntax error: missing ';' before '<'
1>C:\Users\Johnathon\source\repos\pysub1\pysub1\interface.h(11,16): error C4430: missing type specifier - int assumed. Note: C++ does not support default-int
1>C:\Users\Johnathon\source\repos\pysub1\pysub1\interface.h(11,36): error C2238: unexpected token(s) preceding ';'
1>C:\Users\Johnathon\source\repos\pysub1\pysub1\interface.h(12,14): error C3646: 'programCode': unknown override specifier
1>C:\Users\Johnathon\source\repos\pysub1\pysub1\interface.h(12,25): error C4430: missing type specifier - int assumed. Note: C++ does not support default-int
1>C:\Users\Johnathon\source\repos\pysub1\pysub1\interface.h(21,72): error C2065: 'endl': undeclared identifier
1>C:\Users\Johnathon\source\repos\pysub1\pysub1\interface.h(22,91): error C2065: 'endl': undeclared identifier
1>C:\Users\Johnathon\source\repos\pysub1\pysub1\interface.h(23,73): error C2065: 'endl': undeclared identifier
1>Done building project "pysub1.vcxproj" -- FAILED.
========== Build: 0 succeeded, 1 failed, 0 up-to-date, 0 skipped ==========

错误原因与修复方案

所有编译错误的核心原因是未正确引用std命名空间:C++标准库中的容器(vector、string)和IO对象(cout、endl)都定义在std命名空间下,编译器无法识别未加命名空间前缀的这些标识符。

具体修复步骤:

  1. 为vector、string添加std::前缀:
    将typedef vector<string> programType;修改为typedef std::vector<std::string> programType;
  2. 为cout、endl添加std::前缀:
    把所有cout << ... << endl;替换为std::cout << ... << std::endl;
  3. (可选但推荐)初始化循环变量:char q = 'q', input;,避免未初始化变量导致的运行时逻辑错误。

修复后的完整代码

#ifndef INTERFACE_H
#define INTERFACE_H 

#include <iostream>
#include <vector>
#include <string> 

class Interface
{
private:
    typedef std::vector<std::string> programType;
    programType programCode;
    
public:
    void startInterface()
    {
        char q = 'q', input;
        do
        {
            std::cout << "PySUB Interpreter 1.0 on Windows (September 2020)" << std::endl;
            std::cout << "Enter program lines or read(<filename>.py) at command line interface" << std::endl;
            std::cout << "Type 'help' for more information or 'quit' to exit" << std::endl;
        } while (input != q);
    }

    void quit();
    void help();
    void show();
    void clear();
};

#endif

内容的提问来源于stack exchange,提问作者supermage

相关产品推荐
方舟 Agent Plan

超全模态模型 × Harness 升级,最新支持 Deepseek-V4.1-Flash、GLM-5.3 系列、Doubao-Seedream-5.0-pro、Kimi-K3 (部分), 限时 9.9 元起

最近更新时间:2026.08.19 04:15:44