You need to enable JavaScript to run this app.
优惠活动
大模型
产品
解决方案
定价
更多

PySpark任务执行失败:Python worker意外崩溃(collectAndServe方法报错)

PySpark RDD collectAndServe 执行失败:Python Worker 意外崩溃

问题描述

运行PySpark任务时,调用RDD的collectAndServe方法失败,已确认无内存问题且jars目录下所有包均已更新,但Python worker持续意外崩溃,核心报错为Python worker exited unexpectedly (crashed),伴随java.io.EOFException。

报错日志

Driver端报错:

An error occurred while calling z:org.apache.spark.api.python.PythonRDD.collectAndServe.
: org.apache.spark.SparkException: Job aborted due to stage failure: Task 0 in stage 0.0 failed 4 times, most recent failure: Lost task 0.3 in stage 0.0 (TID 3) (10.32.157.249 executor 0): org.apache.spark.SparkException: Python worker exited unexpectedly (crashed)
    at org.apache.spark.api.python.BasePythonRunner$ReaderIterator$$anonfun$1.applyOrElse(PythonRunner.scala:595)
    at org.apache.spark.api.python.BasePythonRunner$ReaderIterator$$anonfun$1.applyOrElse(PythonRunner.scala:577)
    at scala.runtime.AbstractPartialFunction.apply(AbstractPartialFunction.scala:38)
    at org.apache.spark.api.python.PythonRunner$$anon$3.read(PythonRunner.scala:718)
    at org.apache.spark.api.python.PythonRunner$$anon$3.read(PythonRunner.scala:695)
    at org.apache.spark.api.python.BasePythonRunner$ReaderIterator.hasNext(PythonRunner.scala:508)
    at org.apache.spark.InterruptibleIterator.hasNext(InterruptibleIterator.scala:37)
    at scala.collection.Iterator.foreach(Iterator.scala:943)
    at scala.collection.Iterator.foreach$(Iterator.scala:943)
    at org.apache.spark.InterruptibleIterator.foreach(InterruptibleIterator.scala:28)
    at scala.collection.generic.Growable.$plus$plus$eq(Growable.scala:62)
    at scala.collection.generic.Growable.$plus$plus$eq$(Growable.scala:53)
    at scala.collection.mutable.ArrayBuffer.$plus$plus$eq(ArrayBuffer.scala:105)
    at scala.collection.mutable.ArrayBuffer.$plus$plus$eq(ArrayBuffer.scala:49)
    at scala.collection.TraversableOnce.to(TraversableOnce.scala:366)
    at scala.collection.TraversableOnce.to$(TraversableOnce.scala:364)
    at org.apache.spark.InterruptibleIterator.to(InterruptibleIterator.scala:28)
    at scala.collection.TraversableOnce.toBuffer(TraversableOnce.scala:358)
    at scala.collection.TraversableOnce.toBuffer$(TraversableOnce.scala:358)
    at org.apache.spark.InterruptibleIterator.toBuffer(InterruptibleIterator.scala:28)
    at scala.collection.TraversableOnce.toArray(TraversableOnce.scala:345)
    at scala.collection.TraversableOnce.toArray$(TraversableOnce.scala:339)
    at org.apache.spark.InterruptibleIterator.toArray(InterruptibleIterator.scala:28)
    at org.apache.spark.rdd.RDD.$anonfun$collect$2(RDD.scala:1030)
    at org.apache.spark.SparkContext.$anonfun$runJob$5(SparkContext.scala:2254)
    at org.apache.spark.scheduler.ResultTask.runTask(ResultTask.scala:90)
    at org.apache.spark.scheduler.Task.run(Task.scala:131)
    at org.apache.spark.executor.Executor$TaskRunner.$anonfun$run$3(Executor.scala:506)
    at org.apache.spark.util.Utils$.tryWithSafeFinally(Utils.scala:1462)
    at org.apache.spark.executor.Executor$TaskRunner.run(Executor.scala:509)
    at java.util.concurrent.ThreadPoolExecutor.runWorker(ThreadPoolExecutor.java:1149)
    at java.util.concurrent.ThreadPoolExecutor$Worker.run(ThreadPoolExecutor.java:624)
    at java.lang.Thread.run(Thread.java:750)
Caused by: java.io.EOFException
    at java.io.DataInputStream.readInt(DataInputStream.java:392)
    at org.apache.spark.api.python.PythonRunner$$anon$3.read(PythonRunner.scala:703)
    ... 29 more


Driver stacktrace:
    at org.apache.spark.scheduler.DAGScheduler.failJobAndIndependentStages(DAGScheduler.scala:2454)
    at org.apache.spark.scheduler.DAGScheduler.$anonfun$abortStage$2(DAGScheduler.scala:2403)
    at org.apache.spark.scheduler.DAGScheduler.$anonfun$abortStage$2$adapted(DAGScheduler.scala:2402)
    at scala.collection.mutable.ResizableArray.foreach(ResizableArray.scala:62)
    at scala.collection.mutable.ResizableArray.foreach$(ResizableArray.scala:55)
    at scala.collection.mutable.ArrayBuffer.foreach(ArrayBuffer.scala:49)
    at org.apache.spark.scheduler.DAGScheduler.abortStage(DAGScheduler.scala:2402)
    at org.apache.spark.scheduler.DAGScheduler.$anonfun$handleTaskSetFailed$1(DAGScheduler.scala:1160)
    at org.apache.spark.scheduler.DAGScheduler.$anonfun$handleTaskSetFailed$1$adapted(DAGScheduler.scala:1160)
    at scala.Option.foreach(Option.scala:407)
    at org.apache.spark.scheduler.DAGScheduler.handleTaskSetFailed(DAGScheduler.scala:1160)
    at org.apache.spark.scheduler.DAGSchedulerEventProcessLoop.doOnReceive(DAGScheduler.scala:2642)
    at org.apache.spark.scheduler.DAGSchedulerEventProcessLoop.onReceive(DAGScheduler.scala:2584)
    at org.apache.spark.scheduler.DAGSchedulerEventProcessLoop.onReceive(DAGScheduler.scala:2573)
    at org.apache.spark.util.EventLoop$$anon$1.run(EventLoop.scala:49)
    at org.apache.spark.scheduler.DAGScheduler.runJob(DAGScheduler.scala:938)
    at org.apache.spark.SparkContext.runJob(SparkContext.scala:2214)
    at org.apache.spark.SparkContext.runJob(SparkContext.scala:2235)
    at org.apache.spark.SparkContext.runJob(SparkContext.scala:2254)
    at org.apache.spark.SparkContext.runJob(SparkContext.scala:2279)
    at org.apache.spark.rdd.RDD.$anonfun$collect$1(RDD.scala:1030)
    at org.apache.spark.rdd.RDDOperationScope$.withScope(RDDOperationScope.scala:151)
    at org.apache.spark.rdd.RDDOperationScope$.withScope(RDDOperationScope.scala:112)
    at org.apache.spark.rdd.RDD.withScope(RDD.scala:414)
    at org.apache.spark.rdd.RDD.collect(RDD.scala:1029)
    at org.apache.spark.api.python.PythonRDD$.collectAndServe(PythonRDD.scala:180)
    at org.apache.spark.api.python.PythonRDD.collectAndServe(PythonRDD.scala)
    at sun.reflect.NativeMethodAccessorImpl.invoke0(Native Method)
    at sun.reflect.NativeMethodAccessorImpl.invoke(NativeMethodAccessorImpl.java:62)
    at sun.reflect.DelegatingMethodAccessorImpl.invoke(DelegatingMethodAccessorImpl.java:43)
    at java.lang.reflect.Method.invoke(Method.java:498)
    at py4j.reflection.MethodInvoker.invoke(MethodInvoker.java:244)
    at py4j.reflection.ReflectionEngine.invoke(ReflectionEngine.java:357)
    at py4j.Gateway.invoke(Gateway.java:282)
    at py4j.commands.AbstractCommand.invokeMethod(AbstractCommand.java:132)
    at py4j.commands.CallCommand.execute(CallCommand.java:79)
    at py4j.ClientServerConnection.waitForCommands(ClientServerConnection.java:182)
    at py4j.ClientServerConnection.run(ClientServerConnection.java:106)
    at java.lang.Thread.run(Thread.java:750)
Caused by: org.apache.spark.SparkException: Python worker exited unexpectedly (crashed)
    at org.apache.spark.api.python.BasePythonRunner$ReaderIterator$$anonfun$1.applyOrElse(PythonRunner.scala:595)
    at org.apache.spark.api.python.BasePythonRunner$ReaderIterator$$anonfun$1.applyOrElse(PythonRunner.scala:577)
    at scala.runtime.AbstractPartialFunction.apply(AbstractPartialFunction.scala:38)
    at org.apache.spark.api.python.PythonRunner$$anon$3.read(PythonRunner.scala:718)
    at org.apache.spark.api.python.PythonRunner$$anon$3.read(PythonRunner.scala:695)
    at org.apache.spark.api.python.BasePythonRunner$ReaderIterator.hasNext(PythonRunner.scala:508)
    at org.apache.spark.InterruptibleIterator.hasNext(InterruptibleIterator.scala:37)
    at scala.collection.Iterator.foreach(Iterator.scala:943)
    at scala.collection.Iterator.foreach$(Iterator.scala:943)
    at org.apache.spark.InterruptibleIterator.foreach(InterruptibleIterator.scala:28)
    at scala.collection.generic.Growable.$plus$plus$eq(Growable.scala:62)
    at scala.collection.generic.Growable.$plus$plus$eq$(Growable.scala:53)
    at scala.collection.mutable.ArrayBuffer.$plus$plus$eq(ArrayBuffer.scala:105)
    at scala.collection.mutable.ArrayBuffer.$plus$plus$eq(ArrayBuffer.scala:49)
    at scala.collection.TraversableOnce.to(TraversableOnce.scala:366)
    at scala.collection.TraversableOnce.to$(TraversableOnce.scala:364)
    at org.apache.spark.InterruptibleIterator.to(InterruptibleIterator.scala:28)
    at scala.collection.TraversableOnce.toBuffer(TraversableOnce.scala:358)
    at scala.collection.TraversableOnce.toBuffer$(TraversableOnce.scala:358)
    at org.apache.spark.InterruptibleIterator.toBuffer(InterruptibleIterator.scala:28)
    at scala.collection.TraversableOnce.toArray(TraversableOnce.scala:345)
    at scala.collection.TraversableOnce.toArray$(TraversableOnce.scala:339)
    at org.apache.spark.InterruptibleIterator.toArray(InterruptibleIterator.scala:28)
    at org.apache.spark.rdd.RDD.$anonfun$collect$2(RDD.scala:1030)
    at org.apache.spark.SparkContext.$anonfun$runJob$5(SparkContext.scala:2254)
    at org.apache.spark.scheduler.ResultTask.runTask(ResultTask.scala:90)
    at org.apache.spark.scheduler.Task.run(Task.scala:131)
    at org.apache.spark.executor.Executor$TaskRunner.$anonfun$run$3(Executor.scala:506)
    at org.apache.spark.util.Utils$.tryWithSafeFinally(Utils.scala:1462)
    at org.apache.spark.executor.Executor$TaskRunner.run(Executor.scala:509)
    at java.util.concurrent.ThreadPoolExecutor.runWorker(ThreadPoolExecutor.java:1149)
    at java.util.concurrent.ThreadPoolExecutor$Worker.run(ThreadPoolExecutor.java:624)
    ... 1 more
Caused by: java.io.EOFException
    at java.io.DataInputStream.readInt(DataInputStream.java:392)
    at org.apache.spark.api.python.PythonRunner$$anon$3.read(PythonRunner.scala:703)

Executor端stderr日志:

22/10/31 21:43:25 INFO CoarseGrainedExecutorBackend: Got assigned task 3
22/10/31 21:43:25 INFO Executor: Running task 0.3 in stage 0.0 (TID 3)
22/10/31 21:43:25 INFO BlockManager: Found block rdd_3_0 locally
22/10/31 21:43:30 ERROR Executor: Exception in task 0.3 in stage 0.0 (TID 3)
org.apache.spark.SparkException: Python worker exited unexpectedly (crashed)
    at org.apache.spark.api.python.BasePythonRunner$ReaderIterator$$anonfun$1.applyOrElse(PythonRunner.scala:595)
    at org.apache.spark.api.python.BasePythonRunner$ReaderIterator$$anonfun$1.applyOrElse(PythonRunner.scala:577)
    at scala.runtime.AbstractPartialFunction.apply(AbstractPartialFunction.scala:38)
    at org.apache.spark.api.python.PythonRunner$$anon$3.read(PythonRunner.scala:718)
    at org.apache.spark.api.python.PythonRunner$$anon$3.read(PythonRunner.scala:695)
    at org.apache.spark.api.python.BasePythonRunner$ReaderIterator.hasNext(PythonRunner.scala:508)
    at org.apache.spark.InterruptibleIterator.hasNext(InterruptibleIterator.scala:37)
    at scala.collection.Iterator.foreach(Iterator.scala:943)
    at scala.collection.Iterator.foreach$(Iterator.scala:943)
    at org.apache.spark.InterruptibleIterator.foreach(InterruptibleIterator.scala:28)
    at scala.collection.generic.Growable.$plus$plus$eq(Growable.scala:62)
    at scala.collection.generic.Growable.$plus$plus$eq$(Growable.scala:53)
    at scala.collection.mutable.ArrayBuffer.$plus$plus$eq(ArrayBuffer.scala:105)
    at scala.collection.mutable.ArrayBuffer.$plus$plus$eq(ArrayBuffer.scala:49)
    at scala.collection.TraversableOnce.to(TraversableOnce.scala:366)
    at scala.collection.TraversableOnce.to$(TraversableOnce.scala:364)
    at org.apache.spark.InterruptibleIterator.to(InterruptibleIterator.scala:28)
    at scala.collection.TraversableOnce.toBuffer(TraversableOnce.scala:358)
    at scala.collection.TraversableOnce.toBuffer$(TraversableOnce.scala:358)
    at org.apache.spark.InterruptibleIterator.toBuffer(InterruptibleIterator.scala:28)
    at scala.collection.TraversableOnce.toArray(TraversableOnce.scala:345)
    at scala.collection.TraversableOnce.toArray$(TraversableOnce.scala:339)
    at org.apache.spark.InterruptibleIterator.toArray(InterruptibleIterator.scala:28)
    at org.apache.spark.rdd.RDD.$anonfun$collect$2(RDD.scala:1030)
    at org.apache.spark.SparkContext.$anonfun$runJob$5(SparkContext.scala:2254)
    at org.apache.spark.scheduler.ResultTask.runTask(ResultTask.scala:90)
    at org.apache.spark.scheduler.Task.run(Task.scala:131)
    at org.apache.spark.executor.Executor$TaskRunner.$anonfun$run$3(Executor.scala:506)
    at org.apache.spark.util.Utils$.tryWithSafeFinally(Utils.scala:1462)
    at org.apache.spark.executor.Executor$TaskRunner.run(Executor.scala:509)
    at java.util.concurrent.ThreadPoolExecutor.runWorker(ThreadPoolExecutor.java:1149)
    at java.util.concurrent.ThreadPoolExecutor$Worker.run(ThreadPoolExecutor.java:624)
    at java.lang.Thread.run(Thread.java:750)
Caused by: java.io.EOFException
    at java.io.DataInputStream.readInt(DataInputStream.java:392)
    at org.apache.spark.api.python.PythonRunner$$anon$3.read(PythonRunner.scala:703)
    ... 29 more
22/10/31 21:43:30 INFO CoarseGrainedExecutorBackend: Driver commanded a shutdown

环境配置

  • Windows 10
  • Python版本:3.7.0(已尝试升级至3.8)
  • Java版本:1.8.0_333(已尝试更新)
  • Spark版本:3.2.1

解决方案

1. 排查Python依赖版本冲突

PySpark对第三方库版本敏感,尤其是numpy、pandas等:

  • 执行pip list查看依赖版本,确保pyspark与集群版本严格一致(3.2.1)
  • 限制numpy版本在1.18~1.21区间(Spark 3.2.x对高版本numpy兼容性差)
  • 卸载并重装冲突依赖:
pip uninstall -y numpy pandas pyspark
pip install pyspark==3.2.1 numpy==1.21.6 pandas==1.3.5

2. 显式指定Spark Python路径

Windows环境下Spark可能无法自动识别Python路径,需手动配置:

  • 在任务代码开头添加:
import os
os.environ['PYSPARK_PYTHON'] = 'python'  # 或Python绝对路径,如C:/Python37/python.exe
os.environ['PYSPARK_DRIVER_PYTHON'] = 'python'
  • 或在系统环境变量中添加PYSPARK_PYTHON和
相关产品推荐
方舟 Agent Plan

超全模态模型 × Harness 升级,最新支持 Deepseek-V4.1-Flash、GLM-5.3 系列、Doubao-Seedream-5.0-pro、Kimi-K3 (部分), 限时 9.9 元起

最近更新时间:2026.08.14 03:55:28