请求协助解决Flutter编译失败错误:非零退出值1
Flutter构建失败:Gradle任务assembleDebug退出码1
错误详情
FAILURE: 构建过程出现异常。
- 位置:脚本
/Users/cit/flutter/packages/flutter_tools/gradle/flutter.gradle第1159行- 错误原因:任务
:app:compileFlutterBuildDebug执行失败。进程 'command
/Users/cit/flutter/bin/flutter' 以非零退出值1结束
BUILD FAILED in 12s
Exception: Gradle任务 assembleDebug 执行失败,退出码为1
排查与解决步骤
- 执行构建命令时添加
--stacktrace参数,获取详细堆栈跟踪以定位错误根源:flutter build debug --stacktrace - 使用
--info或--debug参数输出更详尽的日志,挖掘具体报错信息:flutter build debug --info # 或 flutter build debug --debug - 添加
--scan参数执行构建,生成完整的构建分析报告:flutter build debug --scan - 额外排查项:
- 运行
flutter doctor检查Flutter及依赖环境是否存在问题,修复提示的异常项 - 执行
flutter clean清理项目缓存后,重新尝试构建 - 确认项目中gradle版本与本地Flutter SDK版本兼容,必要时更新gradle配置
- 运行
内容的提问来源于stack exchange,提问作者riswan
相关产品推荐
相关产品推荐

