Alpine Docker中Redis执行make test失败求助
Redis编译测试失败问题解析
问题背景
在Docker容器中按以下步骤编译安装Redis 6.2.4:
wget https://download.redis.io/releases/redis-6.2.4.tar.gztar xvf redis-6.2.4.tar.gzcd redis-6.2.4make
执行make test时出现如下失败:
!!! WARNING The following tests failed: *** [err]: BITFIELD overflow detection fuzzing in tests/unit/bitfield.tcl OW not detected where needed: i64 -9223372036854775808+-9223372036854775808 Cleanup: may take some time... OK make[1]: *** [Makefile:383: test] Error 1 make[1]: Leaving directory '/var/delphix/redis/redis-6.2.4/src' make: *** [Makefile:6: test] Error 2
错误含义
这个失败是Redis单元测试里BITFIELD指令的溢出检测模糊测试未通过:测试用例对64位有符号整数的最小值(-9223372036854775808)执行加法操作,按照预期应该触发溢出检测,但实际未检测到,导致测试失败。
对安装的影响
- 核心功能不受影响:
make已经完成Redis编译,服务可以正常启动运行,绝大多数常规使用场景(字符串、哈希、列表等基础操作)不会受此问题干扰。 - 特定场景存在风险:如果业务需要使用
BITFIELD指令的i64类型进行可能触发溢出的运算,可能出现预期外结果——本该被拦截的溢出操作未被检测到,导致计算值异常。 - 可选修复方向:若在意这个问题,可以升级到Redis 6.2.x的后续补丁版本(该溢出检测问题已在后续版本修复),或检查Docker容器内编译环境是否存在64位整数运算的兼容性问题。
内容的提问来源于stack exchange,提问作者shipwreck.sam
相关产品推荐
相关产品推荐

