You need to enable JavaScript to run this app.
优惠活动
大模型
产品
解决方案
定价
更多

IntelliJ社区版构建成功但Maven执行mvn clean install失败求助

问题描述

我的Java响应式项目遇到了如下问题:

  • 在IntelliJ中执行mvn clean install可以成功构建,但在命令行执行相同命令时测试失败
  • 最初测试使用AssertNotComplete断言,日志显示响应式测试方法已完成,触发断言错误;将断言改为AssertComplete后,又出现相反错误,提示测试方法未完成
  • 已修改报错对应的代码行,重启IntelliJ并清理缓存,问题仍未解决

错误日志

[ERROR] Tests run: 8, Failures: 1, Errors: 0, Skipped: 2, Time elapsed: 0.969 s <<< FAILURE! - in com.banknational.zeus.services.channel.providedservicepayment.util.CardUtilsTest
[ERROR] com.banknational.zeus.services.channel.providedservicepayment.util.CardUtilsTest.test_ListProducts_Different_FamilyCode_OK  Time elapsed: 0.055 s  <<< FAILURE!
java.lang.AssertionError: Completed! (latch = 0, values = 1, errors = 0, completions = 1)
        at com.banknational.zeus.services.channel.providedservicepayment.util.CardUtilsTest.test_ListProducts_Different_FamilyCode_OK(CardUtilsTest.java:137)

内容的提问来源于stack exchange,提问作者caivosco

相关产品推荐
方舟 Agent Plan

超全模态模型 × Harness 升级,最新支持 Deepseek-V4.1-Flash、GLM-5.3 系列、Doubao-Seedream-5.0-pro、Kimi-K3 (部分), 限时 9.9 元起

最近更新时间:2026.08.06 18:21:33