React Native构建失败:无法打开settings.gradle缓存,提示版本63不支持
Gradle构建失败报错信息
将启动Gradle守护进程,1个已停止的守护进程无法复用,使用`--status`查看详情 FAILURE: 构建失败,出现异常。
问题原因
无法打开设置文件/home/dharmendra/Documents/gitlab/rnative/AwesomeProject/android/settings.gradle的通用类缓存(路径:/home/dharmendra/.gradle/caches/7.5.1/scripts/6hrksilieebwgbc2tk6l5h8hd)。
BUG! 语义分析阶段出现异常,源单元
_BuildScript_存在不支持的类文件主版本63
官方排查建议
使用
--stacktrace选项获取堆栈跟踪
使用--info或--debug选项获取更多日志输出
使用--scan选项获取完整分析信息
BUILD FAILED in 30s error 应用安装失败,请确保已正确配置Android开发环境。 Error: 命令执行失败:`./gradlew app:installDebug -PreactNativeDevServerPort=8081` FAILURE: 构建失败,出现异常。 无法打开设置文件`/home/dharmendra/Documents/gitlab/rnative/AwesomeProject/android/settings.gradle`的通用类缓存(路径:`/home/dharmendra/.gradle/caches/7.5.1/scripts/6hrksilieebwgbc2tk6l5h8hd`)。
内容的提问来源于stack exchange,提问作者Dharmendra Kumar Gond
相关产品推荐
相关产品推荐

