Impala构建日志显示成功却停滞92%,咨询构建是否成功及影响
Apache Impala构建结果判定及后续影响分析
构建是否成功?
此次Impala构建并未完全成功。
从日志来看:
- Maven主导的所有Java相关模块(父POM、外部数据源API、查询引擎前端等)均已构建完成,日志明确打印
BUILD SUCCESS; - 但后续由CMake主导的
notests_all_targets目标构建失败,进度停滞在92%(仅完成java目标),最终抛出make[1]: *** [CMakeFiles/notests_all_targets.dir/rule] error 2和make: *** [notests_all_targets] error 2的错误,说明完整构建流程未走完。
对后续使用的影响
- 仅Java相关组件(如外部数据源开发API、部分前端依赖库)可能可正常使用,但Impala核心服务(由C++实现的impalad、statestored等)未完成构建,无法部署完整的Impala集群提供查询服务;
- 依赖CMake构建的工具、辅助组件缺失,会直接影响后续的运维、扩展及集成测试流程;
- 若仅做Java层面的二次开发(如自定义外部数据源),可能暂时能推进,但涉及完整Impala功能验证、集群部署的环节会完全受阻。
原始构建日志
14:16:50 [INFO] Tests are skipped. 14:16:50 [INFO] Tests are skipped. 14:16:50 [INFO] Apache Impala Parent POM 4.3.0-SNAPSHOT ............ SUCCESS [ 7.434 s] 14:16:50 [INFO] Test Data Generator ................................ SUCCESS [03:03 min] 14:16:50 [INFO] impala-minimal-s3a-aws-sdk ......................... SUCCESS [01:37 min] 14:16:50 [INFO] impala-minimal-hive-exec ........................... SUCCESS [05:16 min] 14:16:50 [INFO] Impala Executor Dependencies ....................... SUCCESS [02:29 min] 14:16:50 [INFO] Apache Impala External Data Source ................. SUCCESS [ 0.009 s] 14:16:50 [INFO] Apache Impala External Data Source API ............. SUCCESS [ 13.566 s] 14:16:50 [INFO] Apache Impala External Data Source Sample .......... SUCCESS [ 0.054 s] 14:16:50 [INFO] Apache Impala External Data Source Test Library .... SUCCESS [ 0.050 s] 14:16:50 [INFO] Apache Impala Query Event Hook API ................. SUCCESS [ 0.025 s] 14:16:50 [INFO] YARN Extras ........................................ SUCCESS [ 0.211 s] 14:16:50 [INFO] Apache Impala Query Engine Frontend ................ SUCCESS [08:39 min] 14:16:50 [INFO] Impala Nested Table Flattener ...................... SUCCESS [ 20.542 s] 14:16:50 [INFO] test-hive-udfs 1.0 ................................. SUCCESS [ 3.012 s] 14:16:50 [INFO] test-corrupt-hive-udfs 1.0 ......................... SUCCESS [ 0.013 s] 14:16:50 [INFO] BUILD SUCCESS [ 92%] Built target java make[1]: *** [CMakeFiles/notests_all_targets.dir/rule] error 2 make: *** [notests_all_targets] error 2
内容的提问来源于stack exchange,提问作者mountainLee
相关产品推荐
相关产品推荐

