You need to enable JavaScript to run this app.
优惠活动
大模型
产品
解决方案
定价
更多

CodeLite搭配MSYS2 g++构建简单main程序出错求助

CodeLite配合MSYS2 MinGW g++编译报错排查

核心问题总结

已配置MSYS2的MinGW g++(12.2.0)到CodeLite,编译极简程序main(){return 0;}时出现shell语法错误+目标文件创建失败,但终端直接执行g++命令可正常编译。

报错关键点

C:/msys64/mingw64/bin/mingw32-make.exe -j20 -e -f  Makefile
----------Building project:[ TestingProject - Debug ]----------
mingw32-make[1]: Entering directory 'D:/Work/Workspaces/CodeLite/TestingProject'
C:/msys64/mingw64/bin/g++.exe  -c  "D:/Work/Workspaces/CodeLite/TestingProject/main.cpp" -Wall  -o ../build-Debug/TestingProject/main.cpp.o -I. -I.
/usr/bin/sh: -c: line 2: syntax error: unexpected end of file
/usr/bin/sh: -c: line 2: syntax error: unexpected end of file
mingw32-make[1]: *** [TestingProject.mk:90: ../build-Debug/TestingProject/.d] Error 2
mingw32-make[1]: *** Waiting for unfinished jobs....
mingw32-make[1]: *** [TestingProject.mk:86: MakeIntermediateDirs] Error 2
Assembler messages:
Fatal error: can't create ../build-Debug/TestingProject/main.cpp.o: No such file or directory
mingw32-make[1]: *** [TestingProject.mk:99: ../build-Debug/TestingProject/main.cpp.o] Error 1
mingw32-make[1]: Leaving directory 'D:/Work/Workspaces/CodeLite/TestingProject'
mingw32-make: *** [Makefile:5: All] Error 2
=== build completed successfully (0 errors, 0 warnings) ===

问题原因及解决步骤

1. Shell环境不匹配(核心原因)

CodeLite默认调用了MSYS2的/usr/bin/sh,但MinGW工具链需搭配MinGW版的sh.exe(位于C:\msys64\mingw64\bin\sh.exe),MSYS的sh会自动转换Windows路径,导致编译命令解析失败。

  • 解决:
    1. 打开CodeLite,进入Settings > Build Settings > Shell
    2. 将Shell to execute build commands in设置为C:\msys64\mingw64\bin\sh.exe
    3. 勾选Use external shell to build选项,保存后重新编译

2. 编译器配置的引号转义错误

报错中编译命令出现"(HTML转义的双引号),说明CodeLite生成Makefile时引号处理异常,导致shell解析命令时语法出错。

  • 解决:
    1. 进入Settings > Build Settings > Compilers > g++
    2. 检查编译器命令行模板,确保源文件路径使用正常双引号",而非转义字符
    3. 若无法定位问题,可重置编译器配置为默认,再重新指向MSYS2的MinGW g++路径(C:\msys64\mingw64\bin\g++.exe)

3. 构建目录未自动创建

报错提示无法创建目标文件,是因为../build-Debug/TestingProject目录未提前生成,CodeLite的Makefile中目录创建步骤执行失败。

  • 解决:
    1. 手动在项目根目录的上级目录创建build-Debug/TestingProject文件夹
    2. 或检查CodeLite项目的Build Settings中输出路径设置,确保路径合法且当前用户有写入权限

内容的提问来源于stack exchange,提问作者BrooklynBoy

相关产品推荐
方舟 Agent Plan

超全模态模型 × Harness 升级,最新支持 Deepseek-V4.1-Flash、GLM-5.3 系列、Doubao-Seedream-5.0-pro、Kimi-K3 (部分), 限时 9.9 元起

最近更新时间:2026.07.28 19:53:07