You need to enable JavaScript to run this app.
优惠活动
大模型
产品
解决方案
定价
更多

Flutter核心文件误修改致编译失败问题求助

Flutter核心文件误修改导致的编译错误解决方法

错误信息

/C:/src/flutter/packages/flutter/lib/src/material/scaffold.dart:1670:17: Error: Final field 'floatingActionButton' is not initialized.
Try to initialize the field in the declaration or in every constructor.
  final Widget? floatingActionButton;
                ^^^^^^^^^^^^^^^^^^^^

Target kernel_snapshot failed: Exception
2

FAILURE: Build failed with an exception.

* Where:
Script 'C:\src\flutter\packages\flutter_tools\gradle\flutter.gradle' line: 1151

* What went wrong:
Execution failed for task ':app:compileFlutterBuildDebug'.
> Process 'command 'C:\src\flutter\bin\flutter.bat'' finished with non-zero exit value 1

* Try:
> Run with --stacktrace option to get the stack trace.
> Run with --info or --debug option to get more log output.
> Run with --scan to get full insights.

* Get more help at https://help.gradle.org

BUILD FAILED in 1m 9s
Exception: Gradle task assembleDebug failed with exit code 1

问题描述

自己的Flutter应用和新建的默认计数器项目都触发上述报错,即使未使用FloatingActionButton组件也会出现。怀疑是编写代码时误修改了Flutter的核心文件,寻求解决方法。

错误截图

解决步骤

  • 确认问题根源:报错指向Flutter核心库的scaffold.dart文件中floatingActionButton字段未初始化,说明该核心文件被误修改。
  • 方法一:恢复单个核心文件
    找到路径C:\src\flutter\packages\flutter\lib\src\material\scaffold.dart,打开后定位到第1670行附近的final Widget? floatingActionButton;,将其恢复为同版本Flutter的原始代码(该字段原本会通过构造函数完成初始化)。
  • 方法二:重置Flutter SDK(最稳妥)
    1. 打开命令行,执行flutter clean清理项目缓存
    2. 执行flutter upgrade --force,强制重置Flutter SDK核心文件至官方原始状态
  • 验证修复:重置完成后,新建默认计数器项目并运行flutter run,若能正常编译运行则问题解决。

内容的提问来源于stack exchange,提问作者mesh

相关产品推荐
方舟 Agent Plan

超全模态模型 × Harness 升级,最新支持 Deepseek-V4.1-Flash、GLM-5.3 系列、Doubao-Seedream-5.0-pro、Kimi-K3 (部分), 限时 9.9 元起

最近更新时间:2026.07.28 00:22:39