Windows10下使用VS2019+GCC编译Linux版CMake C++项目时,如何解决“cannot find -lsqlite3”链接错误?
解决Windows下MinGW编译Linux CMake项目时的sqlite3链接错误
问题背景
我在Windows 10系统上,用GCC/G++(MinGW-W64 8.1.0)和VS2019 IDE编译一个原本基于Linux的CMake C++项目。已经把sqlite3.dll、sqlite3.lib和lsqlite3.so加到PATH环境变量里了,但还是碰到了链接错误,提示cannot find -lsqlite3。
错误日志
[297/795] cmd.exe /C "cd . && C:\PROGRA~1\mingw-w64\x86_64-8.1.0-posix-seh-rt_v6-rev0\mingw64\bin\g++.exe -g -DDEBUG -pthread -O1 -std=c++11 -Wall -g -DDEBUG -pthread -O1 -std=c++11 -Wall -lsqlite3 src/CMakeFiles/hist.dir/apps/MyLinuxBasedCppProject/hist.cc.obj -o ..\..\..\bin\hist.exe -Wl,--out-implib,..\bin\libhist.dll.a -Wl,--major-image-version,0,--minor-image-version,0 ../bin/libMyLinuxBasedCppProject.a -Wl,-Bstatic -lz -Wl,-Bdynamic -lkernel32 -luser32 -lgdi32 -lwinspool -lshell32 -lole32 -loleaut32 -luuid -lcomdlg32 -ladvapi32 && cd ." FAILED: ../../../bin/hist.exe cmd.exe /C "cd . && C:\PROGRA~1\mingw-w64\x86_64-8.1.0-posix-seh-rt_v6-rev0\mingw64\bin\g++.exe -g -DDEBUG -pthread -O1 -std=c++11 -Wall -g -DDEBUG -pthread -O1 -std=c++11 -Wall -lsqlite3 src/CMakeFiles/hist.dir/apps/MyLinuxBasedCppProject/hist.cc.obj -o ..\..\..\bin\hist.exe -Wl,--out-implib,..\bin\libhist.dll.a -Wl,--major-image-version,0,--minor-image-version,0 ../bin/libMyLinuxBasedCppProject.a -Wl,-Bstatic -lz -Wl,-Bdynamic -lkernel32 -luser32 -lgdi32 -lwinspool -lshell32 -lole32 -loleaut32 -luuid -lcomdlg32 -ladvapi32 && cd ." C:/PROGRA~1/mingw-w64/x86_64-8.1.0-posix-seh-rt_v6-rev0/mingw64/bin/../lib/gcc/x86_64-w64-mingw32/8.1.0/../../../../x86_64-w64-mingw32/bin/ld.exe: cannot find -lsqlite3 C:\Users\pc\source\repos\MyLinuxBasedCppProject\out\build\Mingw64-Debug\collect2.exe : error : ld returned 1 exit status [298/795] cmd.exe /C "cd . && C:\PROGRA~1\mingw-w64\x86_64-8.1.0-posix-seh-rt_v6-rev0\mingw64\bin\g++.exe -g -DDEBUG -pthread -O1 -std=c++11 -Wall -g -DDEBUG -pthread -O1 -std=c++11 -Wall -lsqlite3 src/CMakeFiles/seqc.dir/apps/MyLinuxBasedCppProject/seqc.cc.obj -o ..\..\..\bin\seqc.exe -Wl,--out-implib,..\bin\libseqc.dll.a -Wl,--major-image-version,0,--minor-image-version,0 ../bin/libMyLinuxBasedCppProject.a -Wl,-Bstatic -lz -Wl,-Bdynamic -lkernel32 -luser32 -lgdi32 -lwinspool -lshell32 -lole32 -loleaut32 -luuid -lcomdlg32 -ladvapi32 && cd ." FAILED: ../../../bin/seqc.exe cmd.exe /C "cd . && C:\PROGRA~1\mingw-w64\x86_64-8.1.0-posix-seh-rt_v6-rev0\mingw64\bin\g++.exe -g -DDEBUG -pthread -O1 -std=c++11 -Wall -g -DDEBUG -pthread -O1 -std=c++11 -Wall -lsqlite3 src/CMakeFiles/seqc.dir/apps/MyLinuxBasedCppProject/seqc.cc.obj -o ..\..\..\bin\seqc.exe -Wl,--out-implib,..\bin\libseqc.dll.a -Wl,--major-image-version,0,--minor-image-version,0 ../bin/libMyLinuxBasedCppProject.a -Wl,-Bstatic -lz -Wl,-Bdynamic -lkernel32 -luser32 -lgdi32 -lwinspool -lshell32 -lole32 -loleaut32 -luuid -lcomdlg32 -ladvapi32 && cd ." C:/PROGRA~1/mingw-w64/x86_64-8.1.0-posix-seh-rt_v6-rev0/mingw64/bin/../lib/gcc/x86_64-w64-mingw32/8.1.0/../../../../x86_64-w64-mingw32/bin/ld.exe: cannot find -lsqlite3 C:\Users\pc\source\repos\MyLinuxBasedCppProject\out\build\Mingw64-Debug\collect2.exe : error : ld returned 1 exit status
已尝试的CMake配置
find_package(sqlite3) if (SQLITE3_FOUND) message("Sqlite3 found") include_directories(${SQLite3_INCLUDE_DIRS}) SET(CMAKE_CXX_FLAGS_RELEASE " -DSQLITE3 ${CMAKE_CXX_FLAGS_RELEASE}") SET(CMAKE_CXX_FLAGS_DEBUG " -DSQLITE3 ${CMAKE_CXX_FLAGS_DEBUG}") SET(CMAKE_EXE_LINKER_FLAGS "-lsqlite3 -LC:\\Users\\pc\\Downloads\\SQLite 64bit") SET(CMAKE_SHARED_LINKER_FLAGS "-lsqlite3 -LC:\\Users\\pc\\Downloads\\SQLite 64bit" ) else() message("Sqlite3 not found") endif (SQLITE3_FOUND)
解决方案
我帮你分析下问题根源:Windows下MinGW和MSVC的库格式不兼容,你用的sqlite3.lib是MSVC格式的,MinGW不认;另外你的CMake配置也不够规范,导致链接器找不到正确的库。试试下面的步骤:
换用MinGW兼容的sqlite3库
Windows自带的sqlite3.lib是给MSVC编译器用的,MinGW需要的是libsqlite3.a(静态库)或者libsqlite3.dll.a(动态导入库)。你可以去sqlite官网下载预编译的MinGW版本,或者自己用MinGW编译sqlite源码生成对应库文件。修正CMake配置
直接修改CMAKE_EXE_LINKER_FLAGS不是CMake的最佳实践,而且你指定的库路径可能因为空格或者格式问题没生效。建议改成下面的写法,更可靠:# 先尝试自动查找,找不到就手动指定 find_package(SQLite3 QUIET) if(SQLITE3_FOUND) message(STATUS "✅ 找到SQLite3: ${SQLite3_VERSION}") include_directories(${SQLite3_INCLUDE_DIRS}) else() message(STATUS "⚠️ 自动查找SQLite3失败,使用手动路径") # 替换成你实际的sqlite3头文件和库文件路径,尽量用无空格路径 set(SQLITE3_INCLUDE_DIR "C:/Users/pc/Downloads/SQLite64/include") set(SQLITE3_LIBRARY "C:/Users/pc/Downloads/SQLite64/lib/libsqlite3.a") include_directories(${SQLITE3_INCLUDE_DIR}) endif() # 给你的可执行文件添加链接依赖,替换成你实际的目标名称 target_link_libraries(hist PRIVATE ${SQLite3_LIBRARIES} ${SQLITE3_LIBRARY}) target_link_libraries(seqc PRIVATE ${SQLite3_LIBRARIES} ${SQLITE3_LIBRARY})检查路径和架构匹配
- 确保库路径里确实有
libsqlite3.a或libsqlite3.dll.a,路径尽量不要有空格,避免转义错误 - 你的MinGW是x86_64(64位)的,sqlite3库也必须是64位的,32位库会被链接器忽略
- 确保库路径里确实有
刷新环境并重新构建
修改环境变量或CMake配置后,重启VS2019让新配置生效,然后清理之前的构建缓存,重新执行CMake生成和编译。
内容的提问来源于stack exchange,提问作者user366312
相关产品推荐
相关产品推荐

