You need to enable JavaScript to run this app.
优惠活动
大模型
产品
解决方案
定价
更多

dotnet build构建SpecFlow项目时找不到生成的feature.cs文件命名空间

SpecFlow项目dotnet build报错CS0234:找不到Features命名空间

问题详情

尝试在构建代理上构建SpecFlow项目时,运行dotnet build触发CS0234错误,提示EndToEndTests.Features命名空间不存在。Visual Studio构建可正常完成,但本地执行dotnet build也出现相同问题。

构建错误输出

PS C:\repo> dotnet build .\EndToEndTests\
MSBuild version 17.5.1+f6fdcf537 for .NET
  Determining projects to restore...
  All projects are up-to-date for restore.
  SpecFlowFeatureFiles: Features\CreditRisk.feature
  -> Using specflow.json
  SpecFlowGeneratedFiles: Features\CreditRisk.feature.cs
C:\repo\EndToEndTests\StepDefinitions\StepDefinitions.cs(1,30): error CS0234: The type or namespace name 'Features' does not exist in the namespace 'EndToEndTests' (are you missing an assembly reference?) [C:\repo\EndToEndTests\EndToEndTests.csproj]

Build FAILED.

C:\repo\EndToEndTests\StepDefinitions\StepDefinitions.cs(1,30): error CS0234: The type or namespace name 'Features' does not exist in the namespace 'EndToEndTests' (are you missing an assembly reference?) [C:\repo\EndToEndTests\EndToEndTests.csproj]
    0 Warning(s)
    1 Error(s)

Time Elapsed 00:00:04.60

生成文件验证

查看生成的CreditRisk.feature.cs,确认已包含正确命名空间:

// ------------------------------------------------------------------------------
//  <auto-generated>
//      This code was generated by SpecFlow (https://www.specflow.org/).
//      SpecFlow Version:3.9.0.0
//      SpecFlow Generator Version:3.9.0.0
//
//      Changes to this file may cause incorrect behavior and will be lost if
//      the code is regenerated.
//  </auto-generated>
// ------------------------------------------------------------------------------
#region Designer generated code
#pragma warning disable
namespace EndToEndTests.Features
{
    using TechTalk.SpecFlow;
    using System;
    using System.Linq;

...

环境信息

  • .NET版本:7.0.203
  • 全局工具:
PS C:\repo> dotnet tool list --global
Package Id                       Version      Commands
-------------------------------------------------------
specflow.plus.livingdoc.cli      3.9.57       livingdoc

解决方法

1. 确认项目文件包含生成的代码文件

打开EndToEndTests.csproj,检查是否有以下配置,确保生成的.feature.cs被纳入编译:

<ItemGroup>
  <Compile Include="Features\*.feature.cs" />
</ItemGroup>

若缺失则添加该配置。

2. 清理缓存后重新构建

执行以下命令彻底清理项目缓存和生成文件,再重新构建:

dotnet clean .\EndToEndTests\
Remove-Item -Recurse .\EndToEndTests\bin .\EndToEndTests\obj
dotnet build .\EndToEndTests\

3. 对齐SpecFlow版本

全局工具specflow.plus.livingdoc.cli版本为3.9.57,而项目中SpecFlow生成器版本为3.9.0.0,版本不一致可能导致兼容性问题。可:

  • 将项目中SpecFlow相关NuGet包升级至3.9.57
  • 或全局降级工具版本至3.9.0.0:dotnet tool update --global specflow.plus.livingdoc.cli --version 3.9.0.0

4. 检查specflow.json生成路径配置

确认specflow.json中生成文件的输出路径正确,且该路径在项目范围内:

{
  "specFlow": {
    "generation": {
      "outputPath": "Features"
    }
  }
}

内容的提问来源于stack exchange,提问作者bobbybierbrouwer

相关产品推荐
方舟 Agent Plan

超全模态模型 × Harness 升级,最新支持 Deepseek-V4.1-Flash、GLM-5.3 系列、Doubao-Seedream-5.0-pro、Kimi-K3 (部分), 限时 9.9 元起

最近更新时间:2026.07.23 06:23:24