运行iOS模拟器时遇Swift编译警告及Ld构建失败问题
解决Titanium 12.0.0 GA iOS模拟器构建失败问题
错误信息
[ERROR] warning: conditional compilation flags do not have values in Swift; they are either present or absent (rather than 'TI_VERSION=12.0.0')
[ERROR] ** BUILD FAILED **
[ERROR] The following build commands failed:
[ERROR] Ld/Users/user1/Document/Programador/build/iphone/build/Products/Debug-iphonesimulator/Programador.app/Programador normal (in target 'Programador' from project 'Programador')
[ERROR] (1 failure)
Process exited with 1
解决步骤
- 检查项目iOS配置文件(如
ti.xcconfig),找到包含-DTI_VERSION=12.0.0的配置项,将其修改为-DTI_VERSION(移除版本值,只保留标志)。Swift不支持带值的条件编译宏,只能通过标志的存在/缺失来判断。 - 检查项目内的Swift代码,若存在
#if TI_VERSION=12.0.0这类带值的条件编译语句,替换为#if TI_VERSION,或者改用运行时版本判断:通过Titanium提供的API(如TiVersion.version())获取版本号,再做数值比较。 - 清理项目构建缓存,执行命令:
titanium clean,之后重新尝试构建。 - 若问题仍存在,检查项目依赖的Titanium模块/插件,确认是否有模块使用了不符合Swift规范的编译宏,尝试更新模块到适配12.0.0的版本,或移除有问题的模块。
内容的提问来源于stack exchange,提问作者user21856157
相关产品推荐
相关产品推荐

