You need to enable JavaScript to run this app.
优惠活动
大模型
产品
解决方案
定价
更多

安装@tensorflow/tfjs-node-gpu时出现ENOENT错误求助

解决@tensorflow/tfjs-node-gpu安装时的ENOENT错误

错误分析

从日志看,核心问题是安装脚本无法找到tensorflow.dll文件(ENOENT: no such file or directory),原因通常是:

  • libtensorflow依赖包下载不完整或损坏
  • Node.js版本与@tensorflow/tfjs-node-gpu版本不兼容
  • CUDA/cuDNN版本不匹配

解决方案

1. 清理残留并重新初始化安装

  • 删除项目根目录下的node_modules文件夹和package-lock.json文件
  • 清理npm缓存:
    npm cache clean --force
    
  • 卸载已安装的TensorFlow.js相关包:
    npm uninstall @tensorflow/tfjs @tensorflow/tfjs-node-gpu
    

2. 适配Node.js版本

@tensorflow/tfjs-node-gpu 4.9.0官方仅支持Node.js 14.x、16.x、18.x版本,你当前使用的Node.js 20.5.0不在支持列表中,建议降级到LTS版本(比如18.17.0):

  • 使用nvm-windows切换版本:
    nvm install 18.17.0
    nvm use 18.17.0
    

3. 手动补全libtensorflow依赖

  • 从日志中的链接下载libtensorflow-gpu-windows-x86_64-2.9.1.zip
  • 解压后找到lib/tensorflow.dll文件
  • 手动创建目录node_modules/@tensorflow/tfjs-node-gpu/deps/lib/(如果不存在),将tensorflow.dll复制到该目录
  • 重新执行安装命令:
    npm install @tensorflow/tfjs-node-gpu
    

4. 验证CUDA与cuDNN版本兼容性

tfjs-node-gpu 4.9.0要求:

  • CUDA版本:11.2
  • cuDNN版本:8.1
    确保已安装对应版本,且环境变量配置正确:
  • 将CUDA_PATH\bin和CUDA_PATH\libnvvp添加到系统PATH
  • 将cuDNN解压后的bin目录添加到系统PATH

原始错误日志

PS C:\Users\tobia\2d-classification> npm i @tensorflow/tfjs-node-gpu --force
npm WARN using --force Recommended protections disabled.
npm ERR! code 1
npm ERR! path C:\Users\tobia\2d-classification\node_modules\@tensorflow\tfjs-node-gpu
npm ERR! command failed
npm ERR! command C:\WINDOWS\system32\cmd.exe /d /s /c node scripts/install.js gpu download
npm ERR! GPU-windows-4.9.0.zip
npm ERR! https://storage.googleapis.com/tensorflow/libtensorflow/libtensorflow-gpu-windows-x86_64-2.9.1.zip
npm ERR! * Downloading libtensorflow
npm ERR!

npm ERR! * Building TensorFlow Node.js bindings
npm ERR! symlink ./lib/napi-v9 failed:  Error: Command failed: node scripts/deps-stage.js symlink ./lib/napi-v9
npm ERR!   * Symlink of lib\napi-v9\tensorflow.dll failed, creating a copy on disk.
npm ERR! node:internal/process/promises:289
npm ERR!             triggerUncaughtException(err, true /* fromPromise */);
npm ERR!             ^
npm ERR!

npm ERR! [Error: ENOENT: no such file or directory, copyfile 'C:\Users\tobia\2d-classification\node_modules\@tensorflow\tfjs-node-gpu\deps\lib\tensorflow.dll' -> 'C:\Users\tobia\2d-classification\node_modules\@tensorflow\tfjs-node-gpu\lib\napi-v9\tensorflow.dll'] {
npm ERR!   errno: -4058,
npm ERR!   code: 'ENOENT',
npm ERR!   syscall: 'copyfile',
npm ERR!   path: 'C:\\Users\\tobia\\2d-classification\\node_modules\\@tensorflow\\tfjs-node-gpu\\deps\\lib\\tensorflow.dll',
npm ERR!   dest: 'C:\\Users\\tobia\\2d-classification\\node_modules\\@tensorflow\\tfjs-node-gpu\\lib\\napi-v9\\tensorflow.dll'
npm ERR! }
npm ERR!

npm ERR! Node.js v20.5.0
npm ERR!

npm ERR!     at ChildProcess.exithandler (node:child_process:421:12)
npm ERR!     at ChildProcess.emit (node:events:514:28)
npm ERR!     at maybeClose (node:internal/child_process:1105:16)
npm ERR!     at ChildProcess._handle.onexit (node:internal/child_process:305:5) {
npm ERR!   code: 1,
npm ERR!   killed: false,
npm ERR!   signal: null,
npm ERR!   cmd: 'node scripts/deps-stage.js symlink ./lib/napi-v9'
npm ERR! }

npm ERR! A complete log of this run can be found in: C:\Users\tobia\AppData\Local\npm-cache\_logs\2023-07-22T13_17_27_507Z-debug-0.log
PS C:\Users\tobia\2d-classification>

内容的提问来源于stack exchange,提问作者TobCraft

相关产品推荐
方舟 Agent Plan

超全模态模型 × Harness 升级,最新支持 Deepseek-V4.1-Flash、GLM-5.3 系列、Doubao-Seedream-5.0-pro、Kimi-K3 (部分), 限时 9.9 元起

最近更新时间:2026.07.15 03:02:04