Jenkins执行Maven测试时抛出NullPointerException问题求助
Jenkins执行Maven测试全量失败(NullPointerException)排查方案
问题概述
通过Jenkins运行Maven自动化测试时,6个测试用例全部失败,无错误与跳过项,耗时9.662秒。错误堆栈指向TestSuite.CoD_Regression_Test_Suite.TC01_verifyRegistrationFromCheckoutPage方法的CoD_Regression_Test_Suite.java第197行,测试依赖的pom.xml从GitHub仓库拉取。
排查与解决步骤
定位NPE具体触发点
直接打开CoD_Regression_Test_Suite.java查看第197行代码,确认是哪个对象未初始化就被调用。常见触发场景:- Selenium WebDriver实例未在Jenkins环境中正确初始化(比如驱动路径配置错误)
- 测试依赖的配置文件、测试数据未加载成功
- 页面对象(Page Object)未完成实例化
对齐Jenkins与本地环境配置
如果本地运行测试正常,重点排查Jenkins环境差异:- 验证Jenkins节点的JDK、Maven版本与本地完全一致,避免版本兼容问题
- 检查Jenkins中是否配置了正确的浏览器驱动(如ChromeDriver)路径,确保测试能正常启动浏览器
- 查看Jenkins构建日志中的Maven依赖下载环节,确认所有依赖从Maven仓库拉取完成,无缺失
检查测试初始化逻辑
查看测试类中@BeforeClass、@BeforeMethod注解的初始化方法,确认在测试方法执行前,所有必要对象(如WebDriver、数据对象)都已完成初始化
如果是数据驱动测试,确认测试数据文件已被正确拉取到Jenkins工作目录,文件路径配置无误添加调试日志定位问题
在第197行前后添加日志输出,打印相关对象的状态,重新执行构建后查看Jenkins日志,明确对象为null的具体原因。示例:// 第197行前添加日志 System.out.println("待检查对象状态:" + targetObject);
错误堆栈日志
[ERROR] Tests run: 6, Failures: 6, Errors: 0, Skipped: 0, Time elapsed: 9.662 s <<< FAILURE! - in TestSuite [ERROR] TestSuite.CoD_Regression_Test_Suite.TC01_verifyRegistrationFromCheckoutPage Time elapsed: 0.031 s <<< FAILURE! java.lang.NullPointerException at TestSuite.CoD_Regression_Test_Suite.TC01_verifyRegistrationFromCheckoutPage(CoD_Regression_Test_Suite.java:197) at java.base/jdk.internal.reflect.NativeMethodAccessorImpl.invoke0(Native Method) at java.base/jdk.internal.reflect.NativeMethodAccessorImpl.invoke(NativeMethodAccessorImpl.java:62) at java.base/jdk.internal.reflect.DelegatingMethodAccessorImpl.invoke(DelegatingMethodAccessorImpl.java:43) at java.base/java.lang.reflect.Method.invoke(Method.java:566) at org.testng.internal.invokers.MethodInvocationHelper.invokeMethod(MethodInvocationHelper.java:139) at org.testng.internal.invokers.TestInvoker.invokeMethod(TestInvoker.java:677) at org.testng.internal.invokers.TestInvoker.invokeTestMethod(TestInvoker.java:221) at org.testng.internal.invokers.MethodRunner.runInSequence(MethodRunner.java:50) at org.testng.internal.invokers.TestInvoker$MethodInvocationAgent.invoke(TestInvoker.java:962) at org.testng.internal.invokers.TestInvoker.invokeTestMethods(TestInvoker.java:194) at org.testng.internal.invokers.TestMethodWorker.invokeTestMethods(TestMethodWorker.java:148) at org.testng.internal.invokers.TestMethodWorker.run(TestMethodWorker.java:128) at java.base/java.util.ArrayList.forEach(ArrayList.java:1541) at org.testng.TestRunner.privateRun(TestRunner.java:806) at org.testng.TestRunner.run(TestRunner.java:601) at org.testng.SuiteRunner.runTest(SuiteRunner.java:433) at org.testng.SuiteRunner.runSequentially(SuiteRunner.java:427) at org.testng.SuiteRunner.privateRun(SuiteRunner.java:387) at org.testng.SuiteRunner.run(SuiteRunner.java:330) at org.testng.SuiteRunnerWorker.runSuite(SuiteRunnerWorker.java:52) at org.testng.SuiteRunnerWorker.run(SuiteRunnerWorker.java:95) at org.testng.TestNG.runSuitesSequentially(TestNG.java:1256) at org.testng.TestNG.runSuitesLocally(TestNG.java:1176) at org.testng.TestNG.runSuites(TestNG.java:1099) at org.testng.TestNG.run(TestNG.java:1067) at org.apache.maven.surefire.testng.TestNGExecutor.run(TestNGExecutor.java:308) at org.apache.maven.surefire.testng.TestNGXmlTestSuite.execute(TestNGXmlTestSuite.java:71) at org.apache.maven.surefire.testng.TestNGProvider.invoke(TestNGProvider.java:113) at org.apache.maven.surefire.booter.ForkedBooter.runSuitesInProcess(ForkedBooter.java:385) at org.apache.maven.surefire.booter.ForkedBooter.execute(ForkedBooter.java:162) at org.apache.maven.surefire.booter.ForkedBooter.run(ForkedBooter.java:507) at org.apache.maven.surefire.booter.ForkedBooter.main(ForkedBooter.java:495)
内容的提问来源于stack exchange,提问作者Nitin k
相关产品推荐
相关产品推荐

