You need to enable JavaScript to run this app.
优惠活动
大模型
产品
解决方案
定价
更多

Flutter中GetX包translations getter未定义报错求助

解决GetX 4.6.5中GetMaterialApp/GetCupertinoApp未定义translations的编译错误

问题根源

这是GetX 4.6.5版本的内部代码bug——该版本的GetMaterialApp和GetCupertinoApp类并未定义translations字段,但框架自身代码却在尝试调用这个字段,直接导致assembleDebug任务编译失败。

解决方案

方案1:降级到稳定的GetX版本(推荐)

直接修改pubspec.yaml里的GetX依赖为4.6.1版本(该版本无此bug):

dependencies:
  get: ^4.6.1

执行以下命令完成依赖更新与缓存清理:

flutter pub get
flutter clean
flutter run

方案2:升级到更高版本的GetX

若需使用新特性,可升级到5.x及以上版本(注意5.x存在破坏性更新,部分旧代码需适配调整):

dependencies:
  get: ^5.0.0

同样执行flutter pub get、flutter clean后重新运行项目。

方案3:临时手动修复(不推荐)

如果紧急需要使用4.6.5版本,可临时修改依赖源码:

  1. 找到本地pub缓存中的get-4.6.5目录,路径类似../../.pub-cache/hosted/pub.dev/get-4.6.5/
  2. 打开lib/get_navigation/src/root/get_material_app.dart,在GetMaterialApp类的参数中添加:
    final Map<String, Map<String, String>>? translations;
    
    并确保构造函数中保留this.translations,
  3. 对get_cupertino_app.dart执行同样的修改
  4. 重新编译项目

注意:此方法仅为临时补丁,后续更新GetX包后会失效,不建议长期使用。

完整报错信息

Running Gradle task 'assembleDebug'...
../../.pub-cache/hosted/pub.dev/get-4.6.5/lib/get_navigation/src/root/get_material_app.dart:105:10: Error: 'translations' isn't an instance field of this class.
    this.translations,
         ^^^^^^^^^^^^
../../.pub-cache/hosted/pub.dev/get-4.6.5/lib/get_navigation/src/root/get_material_app.dart:216:15: Error: The getter 'translations' isn't defined for the class 'GetMaterialApp'.
 - 'GetMaterialApp' is from 'package:get/get_navigation/src/root/get_material_app.dart' ('../../.pub-cache/hosted/pub.dev/get-4.6.5/lib/get_navigation/src/root/get_material_app.dart').
Try correcting the name to the name of an existing getter, or defining a getter or field named 'translations'.
          if (translations != null) {
              ^^^^^^^^^^^^
../../.pub-cache/hosted/pub.dev/get-4.6.5/lib/get_navigation/src/root/get_material_app.dart:217:33: Error: The getter 'translations' isn't defined for the class 'GetMaterialApp'.
 - 'GetMaterialApp' is from 'package:get/get_navigation/src/root/get_material_app.dart' ('../../.pub-cache/hosted/pub.dev/get-4.6.5/lib/get_navigation/src/root/get_material_app.dart').
Try correcting the name to the name of an existing getter, or defining a getter or field named 'translations'.
            Get.addTranslations(translations!.keys);
                                ^^^^^^^^^^^^
../../.pub-cache/hosted/pub.dev/get-4.6.5/lib/get_navigation/src/root/get_cupertino_app.dart:150:10: Error: 'translations' isn't an instance field of this class.
    this.translations,
         ^^^^^^^^^^^^
../../.pub-cache/hosted/pub.dev/get-4.6.5/lib/get_navigation/src/root/get_cupertino_app.dart:202:15: Error: The getter 'translations' isn't defined for the class 'GetCupertinoApp'.
 - 'GetCupertinoApp' is from 'package:get/get_navigation/src/root/get_cupertino_app.dart' ('../../.pub-cache/hosted/pub.dev/get-4.6.5/lib/get_navigation/src/root/get_cupertino_app.dart').
Try correcting the name to the name of an existing getter, or defining a getter or field named 'translations'.
          if (translations != null) {
              ^^^^^^^^^^^^
../../.pub-cache/hosted/pub.dev/get-4.6.5/lib/get_navigation/src/root/get_cupertino_app.dart:203:33: Error: The getter 'translations' isn't defined for the class 'GetCupertinoApp'.
 - 'GetCupertinoApp' is from 'package:get/get_navigation/src/root/get_cupertino_app.dart' ('../../.pub-cache/hosted/pub.dev/get-4.6.5/lib/get_navigation/src/root/get_cupertino_app.dart').
Try correcting the name to the name of an existing getter, or defining a getter or field named 'translations'.
            Get.addTranslations(translations!.keys);
                                ^^^^^^^^^^^^
Target kernel_snapshot failed: Exception


FAILURE: Build failed with an exception.

* Where:
Script '/home/auriga/snap/flutter/common/flutter/packages/flutter_tools/gradle/flutter.gradle' line: 1201

* What went wrong:
Execution failed for task ':app:compileFlutterBuildDebug'.
> Process 'command '/home/auriga/snap/flutter/common/flutter/bin/flutter'' finished with non-zero exit value 1

* Try:
> Run with --stacktrace option to get the stack trace.
> Run with --info or --debug option to get more log output.
> Run with --scan to get full insights.

* Get more help at https://help.gradle.org

BUILD FAILED in 13s
Exception: Gradle task assembleDebug failed with exit code 1

内容的提问来源于stack exchange,提问作者Harshit

相关产品推荐
方舟 Agent Plan

超全模态模型 × Harness 升级,最新支持 Deepseek-V4.1-Flash、GLM-5.3 系列、Doubao-Seedream-5.0-pro、Kimi-K3 (部分), 限时 9.9 元起

最近更新时间:2026.07.07 05:47:39