You need to enable JavaScript to run this app.
优惠活动
大模型
产品
解决方案
定价
更多

Flutter编译因路径双斜杠引发类识别错误求助

解决Flutter编译中因路径双斜杠导致的类类型不匹配错误

问题描述

编译Flutter应用时触发类识别错误,提示路径中的双斜杠导致同一个类被识别为不同类型,无法完成赋值。错误信息如下:

lib/app//models/account_model.dart:118:23: Error: A value of type 'AccountModel/_1_' can't be assigned to a variable of type 'AccountModel/_2_/'.
- 'AccountModel/_1_/' 来自 'package:mychildren/app//models/account_model.dart' ('lib/app//models/account_model.dart').
- 'AccountModel/_2_/' 来自 'package:mychildren/app/models/account_model.dart' ('lib/app/models/account_model.dart').
globals.account = this;
^
lib/app//models/org_model.dart:120:10: Error: A value of type 'OrgModel/_1_' can't be assigned to a variable of type 'OrgModel/_2_/'.
- 'OrgModel/_1_/' 来自 'package:mychildren/app//models/org_model.dart' ('lib/app//models/org_model.dart').
- 'OrgModel/_2_/' 来自 'package:mychildren/app/models/org_model.dart' ('lib/app/models/org_model.dart').
.firstWhere((igreja) => igreja.docid == this.ig);
^
Target kernel_snapshot failed: Exception

FAILURE: Build failed with an exception.
- 位置:脚本 '/Users/eduardo/development/flutter/packages/flutter_tools/gradle/src/main/groovy/flutter.groovy' 第1350行
- 错误原因:任务 ':app:compileFlutterBuildDebug' 执行失败
  Process 'command '/Users/eduardo/development/flutter/bin/flutter'' finished with non-zero exit value 1
- 建议:
  使用 --stacktrace 选项获取堆栈跟踪;使用 --info 或 --debug 选项获取更多日志输出;使用 --scan 获取完整分析信息
- 更多帮助:https://help.gradle.org

BUILD FAILED in 5s
Exception: Gradle task assembleDebug failed with exit code 1
Exited (1).

Flutter环境信息:

[✓] Flutter (Channel stable, 3.16.8, on macOS 14.0 23A344 darwin-arm64, locale pt-BR)
• Flutter版本3.16.8,稳定版,路径为/Users/eduardo/development/flutter
• 上游仓库:https://github.com/flutter/flutter.git
• Framework版本:67457e669f(7天前,2024-01-16 16:22:29 -0800)
• Engine版本:6e2ea58a5c
• Dart版本:3.2.5
• DevTools版本:2.28.5
[✓] Android工具链 - 开发Android设备(Android SDK版本33.0.0)
[✓] Xcode - 开发iOS和macOS(Xcode 15.0.1)
[✓] Chrome - 开发Web应用
[✓] Android Studio(版本2021.3)
[✓] VS Code(版本1.85.2)
[✓] 已连接设备(3台可用)
[✓] 网络资源
• 未发现问题!

解决方案

1. 检查并修正所有导入语句

全局搜索项目内所有import语句,找出所有包含app//models(双斜杠)的导入,统一替换为app/models(单斜杠)。重点检查globals.dart或其他引用AccountModel、OrgModel的文件,确保所有导入路径格式一致。

2. 清理构建缓存并重新构建

执行以下命令彻底清除旧构建缓存,消除异常路径的残留引用:

flutter clean
flutter pub get
flutter run

3. 检查IDE自动导入设置(可选)

如果是IDE自动生成导入时出现双斜杠,可在VS Code或Android Studio的设置中调整导入路径规则,确保自动导入使用正确的单斜杠格式。

4. 验证pubspec.yaml配置

确认pubspec.yaml中的name字段为mychildren,无拼写错误,避免路径解析时出现异常。

内容的提问来源于stack exchange,提问作者eBapp

相关产品推荐
方舟 Agent Plan

超全模态模型 × Harness 升级,最新支持 Deepseek-V4.1-Flash、GLM-5.3 系列、Doubao-Seedream-5.0-pro、Kimi-K3 (部分), 限时 9.9 元起

最近更新时间:2026.07.01 13:16:15