运行Mule项目时构建失败,如何修复${secure::db.config.name}相关错误?
错误详情
[INFO] ------------------------------------------------------------------------
[INFO] BUILD FAILURE
[INFO] ------------------------------------------------------------------------
[INFO] Total time: 20.385 s
[INFO] Finished at: 2024-05-01T19:15:50+05:30
[INFO] ------------------------------------------------------------------------
[ERROR] Failed to execute goal org.mule.tools.maven:mule-maven-plugin:3.8.2:process-classes (default-process-classes) on project locations-sys-api: Fail to compile: Referenced component '${secure::db.config.name}' must be one of stereotypes [DB:CONFIG]. -> [Help 1]
[ERROR]
[ERROR] To see the full stack trace of the errors, re-run Maven with the -e switch.
[ERROR] Re-run Maven using the -X switch to enable full debug logging.
问题原因
错误核心是:项目中引用的${secure::db.config.name}对应的组件,不是Mule的DB配置类型(DB:CONFIG),或者属性值未指向有效的DB配置组件。
修复步骤
- 确认
secure::db.config.name的属性值:检查安全属性存储(如Anypoint Secure Properties Manager)中该属性的取值,必须是项目内已定义的db:config组件的名称。 - 验证目标组件类型:确保被引用的组件是标准的Mule DB Connector配置(即
<db:config>元素),而非其他类型配置(如HTTP、自定义配置)。 - 检查引用语法:确认Mule配置文件中引用该属性的表达式
${secure::db.config.name}书写正确,无语法错误。 - 清理构建缓存:执行命令
mvn clean install清理旧构建文件,重新构建项目。
内容的提问来源于stack exchange,提问作者Kunal Awasthi

