You need to enable JavaScript to run this app.
优惠活动
大模型
产品
解决方案
定价
更多

Flutter构建失败:':app:compileFlutterBuildDebug'任务执行异常求助

解决Flutter应用构建失败(:app:compileFlutterBuildDebug)的方案

错误信息

Launching lib/main.dart on sdk gphone64 arm64 in debug mode... Running Gradle task 'assembleDebug'...
FAILURE: Build failed with an exception.

  • 出错原因: 任务 ':app:compileFlutterBuildDebug' 执行失败。

启动进程 '/Users/navidrahman/ Developer/ flutter/ bin/ flutter' 时出现问题

  • 建议尝试:

添加 --stacktrace 参数查看堆栈跟踪信息。
添加 --info 或 --debug 参数查看更多日志输出。
添加 --scan 参数获取完整分析报告。

  • 获取更多帮助:https://help.gradle.org
    BUILD FAILED in 15s Exception: Gradle task assembleDebug failed with exit code 1

排查解决步骤

  • 检查Flutter路径正确性:错误提示里的路径包含多余空格,确认本地Flutter SDK实际路径(比如应为/Users/navidrahman/Developer/flutter/bin/flutter),去掉路径中的空格。
  • 清理项目缓存:
    • 执行 flutter clean 清除Flutter侧缓存
    • 进入项目android目录,执行 ./gradlew clean 清除Gradle缓存
  • 验证Flutter环境:运行 flutter doctor 检查环境配置,确保所有依赖都正常配置
  • 重建安卓构建文件:删除项目的android/.gradle、android/build目录,执行 flutter pub get 后重新尝试构建
  • 核对Gradle配置:检查android/build.gradle和android/app/build.gradle中的Flutter路径配置,确保无拼写错误或多余空格
  • 重启IDE与模拟器:IDE缓存或模拟器状态异常可能引发此类问题,重启后再尝试构建

内容的提问来源于stack exchange,提问作者Navid Rahman

相关产品推荐
方舟 Agent Plan

超全模态模型 × Harness 升级,最新支持 Deepseek-V4.1-Flash、GLM-5.3 系列、Doubao-Seedream-5.0-pro、Kimi-K3 (部分), 限时 9.9 元起

最近更新时间:2026.06.24 19:39:51