Visual Studio 2022中使用Conan安装Boost失败的问题排查
Boost 1.85.0 编译失败问题分析与解决方法
问题背景
升级至Visual Studio 2022后,使用Conan 2管理项目依赖时,Boost 1.85.0组件编译失败,构建日志仅提示命令执行错误,无具体编译细节。相关配置与日志片段如下:
输入Profile配置
Host Profile:
[settings] arch=x86_64 build_type=Debug compiler=msvc compiler.cppstd=20 compiler.runtime=dynamic compiler.runtime_type=Debug compiler.version=193 os=Windows [options] boost/*:without_python=True libcurl/*:with_ssl=schannel libraw/*:with_jasper=False zlib/*:shared=False
Build Profile:
[settings] arch=x86_64 build_type=Release os=Windows
核心错误日志
boost/1.85.0 : error : Package '33017ceeaac67a9ba299b4855ce218a9436f8362' build failed boost/1.85.0: WARN: Build folder C:\Users\<my_account>\.conan2\p\b\boost2a738f870ecbe\b\build-debug EXEC : error : boost/1.85.0: Error in build() method, line 1130 self.run(full_command) ConanException: Error 1 while executing
可能原因分析
- 缺乏具体编译错误细节:当前日志仅显示Conan构建命令执行失败,未暴露MSVC编译阶段的具体错误(如语法错误、依赖缺失、组件兼容性问题)。
- Build与Host Profile工具链不统一:Build Profile未指定MSVC版本与运行时配置,可能导致构建依赖工具与目标环境工具链不一致,引发编译冲突。
- Boost 1.85.0新组件兼容性问题:日志中显示正在编译
cobalt组件(Boost 1.85新增),该组件可能与MSVC 193存在未适配的编译问题。 - 缓存文件损坏:Conan缓存的Boost中间构建文件可能存在损坏,导致编译过程中断。
解决方法
- 查看详细编译日志:进入日志提示的Build文件夹
C:\Users\<my_account>\.conan2\p\b\boost2a738f870ecbe\b\build-debug,找到MSBuild生成的BuildLog.htm或控制台输出文件,定位具体编译失败原因(如某个源文件编译错误、链接错误)。 - 统一Build Profile工具链配置:修改Build Profile,添加与Host一致的编译器配置,避免交叉编译冲突:
[settings] arch=x86_64 build_type=Release os=Windows compiler=msvc compiler.version=193 compiler.runtime=dynamic - 禁用Boost新增组件:在Host Profile的options中添加
boost/*:without_cobalt=True,跳过可能存在兼容性问题的cobalt组件编译,再尝试构建。 - 降级Boost版本:临时将Boost版本切换至1.84.0(该版本无cobalt组件,且与MSVC 193兼容性验证更充分),修改项目的Conan依赖配置后重新执行安装。
- 清理Conan缓存:执行命令
conan cache clean boost/1.85.0清除缓存的Boost构建文件,再重新运行conan install命令。
内容的提问来源于stack exchange,提问作者Jean-Milost Reymond
相关产品推荐
相关产品推荐

