You need to enable JavaScript to run this app.
优惠活动
大模型
产品
解决方案
定价
更多

在ns-3.38中集成OpenCV与TensorFlow Lite遇编译配置问题

ns-3.38集成OpenCV与TensorFlow Lite配置问题解决

问题背景

我正在ns-3.38仿真环境中开发一个需要集成OpenCV和TensorFlow Lite的项目,多次修改CMakeLists.txt尝试引入两个库后,仍遇到依赖、路径配置问题,且无法确保库与ns-3.38的兼容性链接。

我尝试的CMake配置

在ns3_cmake_package()之前添加了以下代码到CMakeLists.txt:

#Add OpenCV to the project
find_package(OpenCV REQUIRED)

# Add include directories for OpenCV
include_directories(${OpenCV_INCLUDE_DIRS})

#Add OpenCV to the project
find_package(OpenCV REQUIRED)

# Add include directories for OpenCV
include_directories(${OpenCV_INCLUDE_DIRS})

# Define the executable target for your simulation
add_executable(OpenCV scratch/EDEN/EDEN.cc)
# Link your executable with OpenCV libraries
target_link_libraries(OpenCV ${OpenCV_LIBS})

#----------------------------------------------------------

# Set TensorFlow Lite directories
set(TFLITE_DIR "/home/negar/workspace/tensorflow/tensorflow/lite")
set(TFLITE_LIB "${TFLITE_DIR}/libtensorflow-lite.a")

# Include TensorFlow Lite headers
include_directories("/home/negar/workspace/tensorflow")
include_directories("/home/negar/workspace/flatbuffers/include")

# Define the executable
add_executable(TensorFlow scratch/EDEN/node.cc)

# Link the executable with TensorFlow Lite
target_link_libraries(TensorFlow ${TFLITE_LIB}) 

编译错误信息

执行./ns3 build后返回如下错误:

/home/negar/workspace/ns-allinone-3.38/ns-3.38/scratch/EDEN/node.cc: In member function ‘void NodeServer::LogMobilityData()’:
/home/negar/workspace/ns-allinone-3.38/ns-3.38/scratch/EDEN/node.cc:196:48: error: invalid use of incomplete type ‘class ns3::Node’
  196 |         Ptr<MobilityModel> mobility = GetNode()->GetObject<MobilityModel>();
      |                                                ^~
In file included from /home/negar/workspace/ns-allinone-3.38/ns-3.38/build/include/ns3/application.h:1,
                 from /home/negar/workspace/ns-allinone-3.38/ns-3.38/scratch/EDEN/node.h:4,
                 from /home/negar/workspace/ns-allinone-3.38/ns-3.38/scratch/EDEN/node.cc:1:
/home/negar/workspace/ns-allinone-3.38/ns-3.38/src/network/model/application.h:32:7: note: forward declaration of ‘class ns3::Node’
   32 | class Node;
      |       ^~~~
/home/negar/workspace/ns-allinone-3.38/ns-3.38/scratch/EDEN/node.cc:196:73: error: expected primary-expression before ‘>’ token
  196 |         Ptr<MobilityModel> mobility = GetNode()->GetObject<MobilityModel>();
      |                                                                         ^
/home/negar/workspace/ns-allinone-3.38/ns-3.38/scratch/EDEN/node.cc:196:75: error: expected primary-expression before ‘)’ token
  196 |         Ptr<MobilityModel> mobility = GetNode()->GetObject<MobilityModel>();
      |                                                                           ^
/home/negar/workspace/ns-allinone-3.38/ns-3.38/scratch/EDEN/node.cc:200:29: error: invalid use of incomplete type ‘class ns3::Node’
  200 |                 << GetNode()->GetId() << ","
      |                             ^~
In file included from /home/negar/workspace/ns-allinone-3.38/ns-3.38/build/include/ns3/application.h:1,
                 from /home/negar/workspace/ns-allinone-3.38/ns-3.38/scratch/EDEN/node.h:4,
                 from /home/negar/workspace/ns-allinone-3.38/ns-3.38/scratch/EDEN/node.cc:1:
/home/negar/workspace/ns-allinone-3.38/ns-3.38/src/network/model/application.h:32:7: note: forward declaration of ‘class ns3::Node’
   32 | class Node;
      |       ^~~~
/home/negar/workspace/ns-allinone-3.38/ns-3.38/scratch/EDEN/node.cc:195:22: warning: unused variable ‘data’ [-Wunused-variable]
  195 |     for (const auto& data : m_nodeData) {
      |                      ^~~~
/home/negar/workspace/ns-allinone-3.38/ns-3.38/scratch/EDEN/node.cc: In member function ‘cv::Mat NodeServer::PerformClustering()’:
/home/negar/workspace/ns-allinone-3.38/ns-3.38/scratch/EDEN/node.cc:420:32: error: invalid use of incomplete type ‘class ns3::Node’
  420 |         nodeData.id = GetNode()->GetId();
      |                                ^~
In file included from /home/negar/workspace/ns-allinone-3.38/ns-3.38/build/include/ns3/application.h:1,
                 from /home/negar/workspace/ns-allinone-3.38/ns-3.38/scratch/EDEN/node.h:4,
                 from /home/negar/workspace/ns-allinone-3.38/ns-3.38/scratch/EDEN/node.cc:1:
/home/negar/workspace/ns-allinone-3.38/ns-3.38/src/network/model/application.h:32:7: note: forward declaration of ‘class ns3::Node’
   32 | class Node;
      |       ^~~~
/home/negar/workspace/ns-allinone-3.38/ns-3.38/scratch/EDEN/node.cc: In member function ‘void NodeClient::SendNodeData()’:
/home/negar/workspace/ns-allinone-3.38/ns-3.38/scratch/EDEN/node.cc:485:44: error: invalid use of incomplete type ‘class ns3::Node’
  485 |     Ptr<MobilityModel> mobility = GetNode()->GetObject<MobilityModel>();
      |                                            ^~
In file included from /home/negar/workspace/ns-allinone-3.38/ns-3.38/build/include/ns3/application.h:1,
                 from /home/negar/workspace/ns-allinone-3.38/ns-3.38/scratch/EDEN/node.h:4,
                 from /home/negar/workspace/ns-allinone-3.38/ns-3.38/scratch/EDEN/node.cc:1:
/home/negar/workspace/ns-allinone-3.38/ns-3.38/src/network/model/application.h:32:7: note: forward declaration of ‘class ns3::Node’
   32 | class Node;
      |       ^~~~
/home/negar/workspace/ns-allinone-3.38/ns-3.38/scratch/EDEN/node.cc:485:69: error: expected primary-expression before ‘>’ token
  485 |     Ptr<MobilityModel> mobility = GetNode()->GetObject<MobilityModel>();
      |                                                                     ^
/home/negar/workspace/ns-allinone-3.38/ns-3.38/scratch/EDEN/node.cc:485:71: error: expected primary-expression before ‘)’ token
  485 |     Ptr<MobilityModel> mobility = GetNode()->GetObject<MobilityModel>();
      |                                                                       ^
/home/negar/workspace/ns-allinone-3.38/ns-3.38/scratch/EDEN/node.cc:493:24: error: invalid use of incomplete type ‘class ns3::Node’
  493 |     data.id = GetNode()->GetId();
      |                        ^~
In file included from /home/negar/workspace/ns-allinone-3.38/ns-3.38/build/include/ns3/application.h:1,
                 from /home/negar/workspace/ns-allinone-3.38/ns-3.38/scratch/EDEN/node.h:4,
                 from /home/negar/workspace/ns-allinone-3.38/ns-3.38/scratch/EDEN/node.cc:1:
/home/negar/workspace/ns-allinone-3.38/ns-3.38/src/network/model/application.h:32:7: note: forward declaration of ‘class ns3::Node’
   32 | class Node;
      |       ^~~~
In file included from /home/negar/workspace/ns-allinone-3.38/ns-3.38/src/core/model/event-id.h:23,
                 from /home/negar/workspace/ns-allinone-3.38/ns-3.38/build/include/ns3/event-id.h:1,
                 from /home/negar/workspace/ns-allinone-3.38/ns-3.38/src/network/model/application.h:23,
                 from /home/negar/workspace/ns-allinone-3.38/ns-3.38/build/include/ns3/application.h:1,
                 from /home/negar/workspace/ns-allinone-3.38/ns-3.38/scratch/EDEN/node.h:4,
                 from /home/negar/workspace/ns-allinone-3.38/ns-3.38/scratch/EDEN/node.cc:1:
/home/negar/workspace/ns-allinone-3.38/ns-3.38/src/core/model/ptr.h: In instantiation of ‘ns3::Ptr<T>::~Ptr() [with T = ns3::Node]’:
/home/negar/workspace/ns-allinone-3.38/ns-3.38/scratch/EDEN/node.cc:81:55:   required from here
/home/negar/workspace/ns-allinone-3.38/ns-3.38/src/core/model/ptr.h:727:16: error: invalid use of incomplete type ‘class ns3::Node’
  727 |         m_ptr->Unref();
      |         ~~~~~~~^~~~~
In file included from /home/negar/workspace/ns-allinone-3.38/ns-3.38/build/include/ns3/application.h:1,
                 from /home/negar/workspace/ns-allinone-3.38/ns-3.38/scratch/EDEN/node.h:4,
                 from /home/negar/workspace/ns-allinone-3.38/ns-3.38/scratch/EDEN/node.cc:1:
/home/negar/workspace/ns-allinone-3.38/ns-3.38/src/network/model/application.h:32:7: note: forward declaration of ‘class ns3::Node’
   32 | class Node;
      |       ^~~~
make[2]: *** [CMakeFiles/TensorFlow.dir/build.make:63: CMakeFiles/TensorFlow.dir/scratch/EDEN/node.cc.o] Error 1
make[1]: *** [CMakeFiles/Makefile2:2770: CMakeFiles/TensorFlow.dir/all] Error 2
make: *** [Makefile:141: all] Error 2
Finished executing the following commands:
cd cmake-cache; /usr/bin/cmake --build . -j 1 ; cd ..

解决步骤

1. 修复代码头文件缺失问题

错误提示ns3::Node为不完全类型,说明代码仅获取了Node的前向声明,未包含完整头文件。在node.cc或node.h中添加:

#include "ns3/node.h"

同时,在类成员函数中调用模板函数GetObject时,需显式添加template关键字以帮助编译器识别:

Ptr<MobilityModel> mobility = GetNode()->template GetObject<MobilityModel>();

2. 修正CMakeLists.txt配置

原配置存在重复定义、目标拆分问题,需将OpenCV和TensorFlow Lite集成到同一个仿真目标中:

# 查找OpenCV库
find_package(OpenCV REQUIRED)

# 设置TensorFlow Lite路径
set(TFLITE_DIR "/home/negar/workspace/tensorflow/tensorflow/lite")
set(TFLITE_LIB "${TFLITE_DIR}/libtensorflow-lite.a")

# 定义单个仿真可执行目标
add_executable(EDEN_Simulation scratch/EDEN/EDEN.cc scratch/EDEN/node.cc)

# 添加头文件目录
target_include_directories(EDEN_Simulation PRIVATE
    ${OpenCV_INCLUDE_DIRS}
    "/home/negar/workspace/tensorflow"
    "/home/negar/workspace/flatbuffers/include"
)

# 链接依赖库(包含ns-3模块)
target_link_libraries(EDEN_Simulation PRIVATE
    ${OpenCV_LIBS}
    ${TFLITE_LIB}
    ns3::core
    ns3::network
    ns3::mobility  # 必须链接mobility模块,因代码中用到了MobilityModel
)

注:ns-3推荐使用target_link_libraries直接链接ns3模块,确保依赖模块被正确编译。

3. 启用ns-3必要模块

编译前确保mobility等依赖模块已启用:

./ns3 configure --enable-modules=mobility,network,core

4. 重新编译

清理旧缓存后重新编译:

rm -rf cmake-cache
./ns3 build

内容的提问来源于stack exchange,提问作者Negar Javadzadeh

相关产品推荐
方舟 Agent Plan

超全模态模型 × Harness 升级,最新支持 Deepseek-V4.1-Flash、GLM-5.3 系列、Doubao-Seedream-5.0-pro、Kimi-K3 (部分), 限时 9.9 元起

最近更新时间:2026.06.16 19:33:10